{"text_format":"1","workbook":"xlsx","n_sheets":6,"sheets":["Übersicht","Änderungen","Berechnung","LSS","Lasten","USV"],"not_rendered":{"charts":1,"images":1,"macros":1,"external_links":0,"defined_names":2,"comments":1,"pivot_tables":0},"unopened":[],"bounds":{"document_bytes":16777216,"sheet_cells":100000,"rows_first":2000,"rows_last":500,"rows_between":2000,"halvings":0,"cell_chars":16384,"cell_head_chars":4096},"cells_cut":0,"cells_raw":0,"read":"whole","date_system":"1900"}

{"sheet":"Übersicht","index":0,"n_rows":34,"n_cols":27,"rows_kept":34,"cut":false,"hidden":false,"merged":[[15,18,15,19],[15,25,15,26],[16,19,16,20],[16,24,16,25],[30,18,30,26],[28,18,28,22],[19,18,19,26],[20,18,20,26],[22,18,22,26],[23,18,23,22],[17,19,17,25],[21,18,21,22],[23,23,23,24],[21,23,21,24],[13,1,13,6],[2,19,2,25],[8,19,8,25],[7,24,7,25],[7,19,7,20],[3,19,3,20],[3,24,3,25],[6,18,6,19],[4,18,4,19],[4,25,4,26],[6,25,6,26],[11,19,11,25],[12,19,12,20],[12,24,12,25],[13,18,13,19],[13,25,13,26],[14,1,14,2],[14,3,14,8],[25,3,26,8],[25,1,26,2],[20,1,20,8],[17,1,18,8],[33,1,38,8],[28,1,28,8],[32,18,32,26],[24,23,24,24],[25,23,25,24],[26,23,26,24],[27,23,27,24],[28,23,28,24],[31,18,31,26],[27,18,27,22],[29,18,29,22],[29,23,29,24],[26,18,26,22],[25,18,25,22],[24,18,24,22],[21,3,24,8]]}
[]
[null,"Information 1:",null,null,null,null,null,null,null,"Nennstrom:","Faktor:"]
[null,"Welchen Nennstrom IN,UPS liefert die USV-Anlage?",null,null,null,null,null,null,"A",null,null,null,null,null,null,null,null,null,null,{"$f":"CHOOSE(AA3,\"\",Berechnung!A11,Berechnung!C11,Berechnung!E11,Berechnung!G11,Berechnung!I11,Berechnung!K11,Berechnung!M11)","v":""},null,null,null,null,null,null,1]
[null,"oder",null,null,null,null,null,{"$f":"IF(AND(ISNUMBER(H3),ISNUMBER(H5)),\"Bitte nur ein Feld befüllen\",\"\")","v":""},null,{"$f":"IF(ISNUMBER(H3),H3,(1000*H5/(230*(2*H6-1))))","v":0},{"$f":"L20/J4","v":{"$error":"#DIV/0!"}},null,{"$f":"CHOOSE(H17,J21,J22,J23,J24,J25,J26,J27,J28,J29,J30,J31)","v":1.5},null,null,null,null,null,null,{"$f":"CHOOSE(AA3,\"\",Berechnung!A20,Berechnung!C20,Berechnung!E20,Berechnung!G20,Berechnung!I20,Berechnung!K20,Berechnung!M20)","v":""},null,null,null,null,{"$f":"CHOOSE(AA3,\"\",Berechnung!A12,Berechnung!C12,Berechnung!E12,Berechnung!G12,Berechnung!I12,Berechnung!K12,Berechnung!M12)","v":""}]
[null,"Welche Leistung hat die USV-Anlage",null,null,null,null,null,null,"kVA",null,{"$f":"H11/K20","v":{"$error":"#DIV/0!"}},null,null,null,null,null,null,null,{"$f":"CHOOSE(AA3,\"\",Berechnung!A19,Berechnung!C19,Berechnung!E19,Berechnung!G19,Berechnung!I19,Berechnung!K19,Berechnung!M19)","v":""},null,null,null,null,null,null,{"$f":"CHOOSE(AA3,\"\",Berechnung!A13,Berechnung!C13,Berechnung!E13,Berechnung!G13,Berechnung!I13,Berechnung!K13,Berechnung!M13)","v":""}]
[null,"bei Anzahl Phasen",null,null,null,null,null,1,{"$f":"IF(ISNUMBER(H5),CONCATENATE(\" I_N,UPS = \",ROUND(J4,1),\" A\"),\"\")","v":""}]
[null,null,null,null,null,null,null,null,null,"1phasig",null,null,null,null,null,null,null,null,{"$f":"CHOOSE(AA3,\"\",Berechnung!A18,Berechnung!C18,Berechnung!E18,Berechnung!G18,Berechnung!I18,Berechnung!K18,Berechnung!M18)","v":""},null,null,null,null,null,null,{"$f":"CHOOSE(AA3,\"\",Berechnung!A14,Berechnung!C14,Berechnung!E14,Berechnung!G14,Berechnung!I14,Berechnung!K14,Berechnung!M14)","v":""}]
[null,"Information 2:",null,null,null,null,null,null,null,"3phasig",null,null,null,null,null,null,null,null,null,{"$f":"CHOOSE(AA3,\"\",Berechnung!A17,Berechnung!C17,Berechnung!E17,Berechnung!G17,Berechnung!I17,Berechnung!K17,Berechnung!M17)","v":""},null,null,null,null,{"$f":"CHOOSE(AA3,\"\",Berechnung!A15,Berechnung!C15,Berechnung!E15,Berechnung!G15,Berechnung!I15,Berechnung!K15,Berechnung!M15)","v":""}]
[null,"Welcher Leitungsschutz-Typ wird bisher verwendet?",null,null,null,null,null,10,null,null,"Mindestauslösestrom","Höchstauslösestrom","Kommentar Fehlauslösung","Kommentar Kurzschluss","EBU I_Nenn,min",null,null,null,null,{"$f":"CHOOSE(AA3,\"\",Berechnung!A16,Berechnung!C16,Berechnung!E16,Berechnung!G16,Berechnung!I16,Berechnung!K16,Berechnung!M16)","v":""}]
[null,"oder",null,null,null,null,null,null,null,"\"kleiner\"",17.899999999999999,29.9,{"$f":"IF($H$11<$K10,CONCATENATE(\"Fehlauslösungen unwahrscheinlich.\"),CONCATENATE(\"Fehlauslösungen wahrscheinlich\"))","v":"Fehlauslösungen unwahrscheinlich."},{"$f":"IF(($J$4*M4)>$L10,CONCATENATE(\"Auslösung mit dem <\",ROUND($L10/$J$4,1),\"-fachen USV-Nennstrom wahrscheinlich.*\"),CONCATENATE(\"Auslösung mit dem <\",ROUND($L10/$J$4,1),\"-fachen USV-Nennstrom unwahrscheinlich.*\"))","v":{"$error":"#DIV/0!"}},null,null,null,null,null,null,null,null,null,null,null,null,"IN,UPS"]
[null,"Wie hoch ist der Einschaltstrom der angeschlossenen Last?",null,null,null,null,null,null,"A","B6",18,30,{"$f":"IF($H$11<$K11,CONCATENATE(\"Der Einschaltstrom erreicht den Mindestauslösestrom zu \",ROUND(100*$H$11/$K11,0),\"%. Es treten keine Fehlauslösungen auf.\"),CONCATENATE(\"Der Einschaltstrom überschreitet den Mindestauslösestrom zu \",ROUND(100*$H$11/$K11,0),\"%. Es treten möglicherweise Fehlauslösungen auf.\"))","v":"Der Einschaltstrom erreicht den Mindestauslösestrom zu 0%. Es treten keine Fehlauslösungen auf."},{"$f":"IF(($J$4*$M$4)>=$L11,CONCATENATE(\"Der bisher verwendete Leitungsschutzschalter kann von der USV-Anlage mit dem \",ROUND($L11/$J$4,1),\"-fachen USV-Nennstrom sicher ausgelöst werden.\"),CONCATENATE(\"Für die sichere Auslösung wäre der \",ROUND($L11/$J$4,1),\"-fache USV-Nennstrom notwendig. Dieser Wert wird durch die USV-Anlage nicht erreicht!\"))","v":{"$error":"#DIV/0!"}},7,{"$f":"IF(AND($H$14<INDEX(Berechnung!$A$20:$N$20,1,2*(ROW($O11)-ROW($O$10))),$O11<$J$4,ISBLANK($H$11),INDEX($K$10:$K$19,$H$9,1)<=$K11),TRUE,IF(AND($O11<$J$4,$H$11<(1.067*$K11),ISNUMBER($H$11)),TRUE,FALSE))","v":false},{"$f":"MATCH(TRUE,OFFSET($P$11:$P$17,0,,),0)","v":{"$error":"#N/A"}}]
[null,null,null,null,null,null,null,null,null,"B10",30,50,"Der Einschaltstrom erreicht den Mindestauslösestrom zu 0%. Es treten keine Fehlauslösungen auf.",{"$error":"#DIV/0!"},11,{"$f":"IF(AND($H$14<INDEX(Berechnung!$A$20:$N$20,1,2*(ROW($O12)-ROW($O$10))),$O12<$J$4,ISBLANK($H$11),INDEX($K$10:$K$19,$H$9,1)<=$K12),TRUE,IF(AND($O12<$J$4,$H$11<(1.067*$K12),ISNUMBER($H$11)),TRUE,FALSE))","v":false},{"$f":"MATCH(TRUE,OFFSET($P$11:$P$17,Q11,),0)+Q11","v":{"$error":"#N/A"}},null,null,{"$f":"CHOOSE(AA3,\"\",Berechnung!B11,Berechnung!D11,Berechnung!F11,Berechnung!H11,Berechnung!J11,Berechnung!L11,Berechnung!N11)","v":""}]
[null,"Optional Information 3:",null,null,null,null,null,null,null,"B16",48,80,"Der Einschaltstrom erreicht den Mindestauslösestrom zu 0%. Es treten keine Fehlauslösungen auf.",{"$error":"#DIV/0!"},17,{"$f":"IF(AND($H$14<INDEX(Berechnung!$A$20:$N$20,1,2*(ROW($O13)-ROW($O$10))),$O13<$J$4,ISBLANK($H$11),INDEX($K$10:$K$19,$H$9,1)<=$K13),TRUE,IF(AND($O13<$J$4,$H$11<(1.067*$K13),ISNUMBER($H$11)),TRUE,FALSE))","v":false},{"$error":"#N/A"},null,null,{"$f":"CHOOSE(AA3,\"\",Berechnung!B20,Berechnung!D20,Berechnung!F20,Berechnung!H20,Berechnung!J20,Berechnung!L20,Berechnung!N20)","v":""},null,null,null,null,{"$f":"CHOOSE(AA3,\"\",Berechnung!B12,Berechnung!D12,Berechnung!F12,Berechnung!H12,Berechnung!J12,Berechnung!L12,Berechnung!N12)","v":""}]
[null,"Was ist der Nennstrom IN,Load der angeschlossenen Last?",null,null,null,null,null,null,"A","C4",20,40,"Der Einschaltstrom erreicht den Mindestauslösestrom zu 0%. Es treten keine Fehlauslösungen auf.",{"$error":"#DIV/0!"},4.3,{"$f":"IF(AND($H$14<INDEX(Berechnung!$A$20:$N$20,1,2*(ROW($O14)-ROW($O$10))),$O14<$J$4,ISBLANK($H$11),INDEX($K$10:$K$19,$H$9,1)<=$K14),TRUE,IF(AND($O14<$J$4,$H$11<(1.067*$K14),ISNUMBER($H$11)),TRUE,FALSE))","v":false},{"$error":"#N/A"},null,{"$f":"CHOOSE(AA3,\"\",Berechnung!B19,Berechnung!D19,Berechnung!F19,Berechnung!H19,Berechnung!J19,Berechnung!L19,Berechnung!N19)","v":""},null,null,null,null,null,null,{"$f":"CHOOSE(AA3,\"\",Berechnung!B13,Berechnung!D13,Berechnung!F13,Berechnung!H13,Berechnung!J13,Berechnung!L13,Berechnung!N13)","v":""}]
[null,null,null,null,null,null,null,null,null,"C6",30,60,"Der Einschaltstrom erreicht den Mindestauslösestrom zu 0%. Es treten keine Fehlauslösungen auf.",{"$error":"#DIV/0!"},7,{"$f":"IF(AND($H$14<INDEX(Berechnung!$A$20:$N$20,1,2*(ROW($O15)-ROW($O$10))),$O15<$J$4,ISBLANK($H$11),INDEX($K$10:$K$19,$H$9,1)<=$K15),TRUE,IF(AND($O15<$J$4,$H$11<(1.067*$K15),ISNUMBER($H$11)),TRUE,FALSE))","v":false},{"$error":"#N/A"}]
[null,"Optional Information 4:",null,null,null,null,null,null,null,"C10",50,100,"Der Einschaltstrom erreicht den Mindestauslösestrom zu 0%. Es treten keine Fehlauslösungen auf.",{"$error":"#DIV/0!"},11,{"$f":"IF(AND($H$14<INDEX(Berechnung!$A$20:$N$20,1,2*(ROW($O16)-ROW($O$10))),$O16<$J$4,ISBLANK($H$11),INDEX($K$10:$K$19,$H$9,1)<=$K16),TRUE,IF(AND($O16<$J$4,$H$11<(1.067*$K16),ISNUMBER($H$11)),TRUE,FALSE))","v":false},{"$error":"#N/A"},null,{"$f":"CHOOSE(AA3,\"\",Berechnung!B18,Berechnung!D18,Berechnung!F18,Berechnung!H18,Berechnung!J18,Berechnung!L18,Berechnung!N18)","v":""},null,null,null,null,null,null,{"$f":"CHOOSE(AA3,\"\",Berechnung!B14,Berechnung!D14,Berechnung!F14,Berechnung!H14,Berechnung!J14,Berechnung!L14,Berechnung!N14)","v":""}]
[null,"Wie groß ist der Kurzschlussstrom gegenüber dem Nennstrom",null,null,null,null,null,5,{"$f":"IF(J4>0,CONCATENATE(\"I_KS = \",ROUND(M4*J4,1),\" A\"),\"\")","v":""},"C16",80,160,"Der Einschaltstrom erreicht den Mindestauslösestrom zu 0%. Es treten keine Fehlauslösungen auf.",{"$error":"#DIV/0!"},17,{"$f":"IF(AND($H$14<INDEX(Berechnung!$A$20:$N$20,1,2*(ROW($O17)-ROW($O$10))),$O17<$J$4,ISBLANK($H$11),INDEX($K$10:$K$19,$H$9,1)<=$K17),TRUE,IF(AND($O17<$J$4,$H$11<(1.067*$K17),ISNUMBER($H$11)),TRUE,FALSE))","v":false},{"$error":"#N/A"},null,null,{"$f":"CHOOSE(AA3,\"\",Berechnung!B17,Berechnung!D17,Berechnung!F17,Berechnung!H17,Berechnung!J17,Berechnung!L17,Berechnung!N17)","v":""},null,null,null,null,{"$f":"CHOOSE(AA3,\"\",Berechnung!B15,Berechnung!D15,Berechnung!F15,Berechnung!H15,Berechnung!J15,Berechnung!L15,Berechnung!N15)","v":""}]
[null,{"$f":"IF(M4>2,\"Zur Beachtung: Der verfügbare Kurzschlussstrom wird durch parallele Lastzweige, geringen Ladezustand und gealterte Batterie verringert! Wir raten von Werten > 200 % ab!\",\"\")","v":""},null,null,null,null,null,null,null,"\"größer\"",80.099999999999994,160.1,{"$f":"IF($H$11<$K18,CONCATENATE(\"Fehlauslösungen unwahrscheinlich.\"),CONCATENATE(\"Fehlauslösungen wahrscheinlich\"))","v":"Fehlauslösungen unwahrscheinlich."},{"$f":"IF(($J$4*M4)>$L18,CONCATENATE(\"Auslösung mit dem >\",ROUND($L18/$J$4,1),\"-fachen USV-Nennstrom wahrscheinlich.*\"),CONCATENATE(\"Auslösung mit dem >\",ROUND($L18/$J$4,1),\"-fachen USV-Nennstrom unwahrscheinlich.*\"))","v":{"$error":"#DIV/0!"}},null,null,null,null,null,{"$f":"CHOOSE(AA3,\"\",Berechnung!B16,Berechnung!D16,Berechnung!F16,Berechnung!H16,Berechnung!J16,Berechnung!L16,Berechnung!N16)","v":""}]
[null,null,null,null,null,null,null,null,null,"keine Angabe",null,null,"Keine Angabe","Keine Angabe",null,null,null,null,null,null,null,null,null,null,null,null,"IN,LOAD"]
[null,null,null,null,null,null,null,null,null,null,{"$f":"INDEX(K10:K19,H9,1)","v":0},{"$f":"INDEX(L10:L19,H9,1)","v":0},null,null,null,null,null,null,"Legende mit Nennströmen"]
[null,"Bisherige Lösung",null,null,null,null,null,null,null,1.1000000000000001,null,null,null,null,null,null,null,null,"Typische USV-Kennlinie"]
[null,"Auslösung bei Kurzschluss",null,{"$f":"IFERROR(INDEX(N10:N19,H9,1),\"Keine Angabe\")","v":"Keine Angabe"},null,null,null,null,null,1.2,null,null,null,null,null,null,null,null,"USV",null,null,null,null,{"$f":"$J$4","v":0},null,"A"]
[null,null,null,null,null,null,null,null,null,1.25,null,null,null,null,null,null,null,null,"Typische Lastkennlinien"]
[null,null,null,null,null,null,null,null,null,1.3,null,null,null,null,null,null,null,null,"Pumpe",null,null,null,null,{"$f":"$H$14","v":0},null,"A"]
[null,null,null,null,null,null,null,null,null,1.5,null,null,null,null,null,null,null,null,"Netzteil mittel",null,null,null,null,{"$f":"$H$14","v":0},null,"A"]
[null,"Fehlauslösung bei Einschalten",null,{"$f":"IF(ISNUMBER(H11),INDEX(M10:M19,H9,1),\"Keine Angabe über Einschaltstrom der Last\")","v":"Keine Angabe über Einschaltstrom der Last"},null,null,null,null,null,1.8,null,null,null,null,null,null,null,null,"Heizlast",null,null,null,null,0,null,"A"]
[null,null,null,null,null,null,null,null,null,2,null,null,null,null,null,null,null,null,"Frequenzumr.",null,null,null,null,0,null,"A"]
[null,null,null,null,null,null,null,null,null,2.2000000000000002,null,null,null,null,null,null,null,null,"AC-Motor",null,null,null,null,0,null,"A"]
[null,"Vorschlag EBU",null,null,null,null,null,null,null,2.5,null,null,null,null,null,null,null,null,"Netzteil stark",null,null,null,null,0,null,"A"]
[null,null,{"$f":"_xlfn.IFNA(Q11,\"\")","v":""},{"$f":"_xlfn.IFNA(Q12,\"\")","v":""},{"$f":"_xlfn.IFNA(Q13,\"\")","v":""},{"$f":"_xlfn.IFNA(Q14,\"\")","v":""},{"$f":"_xlfn.IFNA(Q15,\"\")","v":""},{"$f":"_xlfn.IFNA(Q16,\"\")","v":""},{"$f":"_xlfn.IFNA(Q17,\"\")","v":""},2.8,null,null,null,null,null,null,null,null,"Eingabe",null,null,null,null,0,null,"A"]
[null,"Typen",{"$f":"_xlfn.IFNA(INDEX($J$11:$J$17,Q11,1),\"\")","v":""},{"$f":"_xlfn.IFNA(INDEX($J$11:$J$17,Q12,1),\"\")","v":""},{"$f":"_xlfn.IFNA(INDEX($J$11:$J$17,Q13,1),\"\")","v":""},{"$f":"_xlfn.IFNA(INDEX($J$11:$J$17,Q14,1),\"\")","v":""},{"$f":"_xlfn.IFNA(INDEX($J$11:$J$17,Q15,1),\"\")","v":""},{"$f":"_xlfn.IFNA(INDEX($J$11:$J$17,Q16,1),\"\")","v":""},{"$f":"_xlfn.IFNA(INDEX($J$11:$J$17,Q17,1),\"\")","v":""},3,null,null,null,null,null,null,null,null,"EBU"]
[null,"IN,UPS",{"$f":"IFERROR(LOOKUP($J$4,OFFSET(Berechnung!$A$11:$A$20,,(Übersicht!C$30-1)*2)),\"\")","v":""},{"$f":"IFERROR(LOOKUP($J$4,OFFSET(Berechnung!$A$11:$A$20,,(Übersicht!D$30-1)*2)),\"\")","v":""},{"$f":"IFERROR(LOOKUP($J$4,OFFSET(Berechnung!$A$11:$A$20,,(Übersicht!E$30-1)*2)),\"\")","v":""},{"$f":"IFERROR(LOOKUP($J$4,OFFSET(Berechnung!$A$11:$A$20,,(Übersicht!F$30-1)*2)),\"\")","v":""},{"$f":"IFERROR(LOOKUP($J$4,OFFSET(Berechnung!$A$11:$A$20,,(Übersicht!G$30-1)*2)),\"\")","v":""},{"$f":"IFERROR(LOOKUP($J$4,OFFSET(Berechnung!$A$11:$A$20,,(Übersicht!H$30-1)*2)),\"\")","v":""},{"$f":"IFERROR(LOOKUP($J$4,OFFSET(Berechnung!$A$11:$A$20,,(Übersicht!I$30-1)*2)),\"\")","v":""},null,null,null,null,null,null,null,null,null,"thermisch-magnetisch"]
[null,"IN,LOAD",{"$f":"IF(ISNUMBER(C$30),IFERROR(IF(ISNUMBER($H$14),MIN(IF((OFFSET(Berechnung!$B$11:$B$20,,(Übersicht!C$30-1)*2))>$H$14,(OFFSET(Berechnung!$B$11:$B$20,,(Übersicht!C$30-1)*2)))),\"OFF\"),\"\"),\"\")","v":""},{"$f":"IF(ISNUMBER(D$30),IFERROR(IF(ISNUMBER($H$14),MIN(IF((OFFSET(Berechnung!$B$11:$B$20,,(Übersicht!D$30-1)*2))>$H$14,(OFFSET(Berechnung!$B$11:$B$20,,(Übersicht!D$30-1)*2)))),\"OFF\"),\"\"),\"\")","v":""},{"$f":"IF(ISNUMBER(E$30),IFERROR(IF(ISNUMBER($H$14),MIN(IF((OFFSET(Berechnung!$B$11:$B$20,,(Übersicht!E$30-1)*2))>$H$14,(OFFSET(Berechnung!$B$11:$B$20,,(Übersicht!E$30-1)*2)))),\"OFF\"),\"\"),\"\")","v":""},{"$f":"IF(ISNUMBER(F$30),IFERROR(IF(ISNUMBER($H$14),MIN(IF((OFFSET(Berechnung!$B$11:$B$20,,(Übersicht!F$30-1)*2))>$H$14,(OFFSET(Berechnung!$B$11:$B$20,,(Übersicht!F$30-1)*2)))),\"OFF\"),\"\"),\"\")","v":""},{"$f":"IF(ISNUMBER(G$30),IFERROR(IF(ISNUMBER($H$14),MIN(IF((OFFSET(Berechnung!$B$11:$B$20,,(Übersicht!G$30-1)*2))>$H$14,(OFFSET(Berechnung!$B$11:$B$20,,(Übersicht!G$30-1)*2)))),\"OFF\"),\"\"),\"\")","v":""},{"$f":"IF(ISNUMBER(H$30),IFERROR(IF(ISNUMBER($H$14),MIN(IF((OFFSET(Berechnung!$B$11:$B$20,,(Übersicht!H$30-1)*2))>$H$14,(OFFSET(Berechnung!$B$11:$B$20,,(Übersicht!H$30-1)*2)))),\"OFF\"),\"\"),\"\")","v":""},{"$f":"IF(ISNUMBER(I$30),IFERROR(IF(ISNUMBER($H$14),MIN(IF((OFFSET(Berechnung!$B$11:$B$20,,(Übersicht!I$30-1)*2))>$H$14,(OFFSET(Berechnung!$B$11:$B$20,,(Übersicht!I$30-1)*2)))),\"OFF\"),\"\"),\"\")","v":""},null,null,null,null,null,null,null,null,null,"elektronisch"]
[null,"In der Vorschlagsliste werden alle elektrisch möglichen Varianten aufgezählt.\nLiegt eine Angabe über den bisher verwendeten Leitungsschutz vor, wird eine Empfehlung für diesen Typ ausgesprochen. Es wird kein Typ \"unterhalb\" des verwendeten Leitungsschutz vorgeschlagen, um Fehlauslösungen zu vermeiden. Das kann durch die Auswahl \"keine Angabe\" oder durch Eingabe des tatsächlichen Einschaltstroms überschrieben werden.\n\nDiese Datei dient nur als Planungshilfe!\nBitte beachten Sie des weiteren die einschlägig gültigen internationalen Normen und Vorschriften.\n\n© E-T-A Elektrotechnische Apparate GmbH - Industriestraße 2-8 - 90518 Altdorf\nV 1.0.0 - 25.07.2018"]

{"sheet":"Änderungen","index":1,"n_rows":1,"n_cols":2,"rows_kept":1,"cut":false,"hidden":true,"merged":[]}
["V 1.0.0","- Hinweise wegen logarithmischer Darstellung eliminiert --> Keine 0-Werte mehr\n- Eingabe des Kurzschlussstroms ermöglicht\n- Bei jedem Öffnen der Datei wird ein leeres Grafikfenster angezeigt. Wenn eine Eingabe des LSS erfolgt, wird die dazu passende Kennlinie angezeigt. Wenn ein EBU gewählt wird, wird diese LSS-Kennlinie mit dem EBU überschrieben"]

{"sheet":"Berechnung","index":2,"n_rows":74,"n_cols":14,"rows_kept":74,"cut":false,"hidden":true,"merged":[]}
[null,null,409.6,409.6,"(2/5)*1024",null,null,null,"wählen"]
[null,null,1,1,null,{"$f":"IF(Übersicht!AA3=1,Übersicht!H9-1,Übersicht!AA3-1)","v":9},0,0,"B6",{"$f":"CHOOSE(F2,I2,I3,I4,I5,I6,I7,I8)","v":{"$error":"#VALUE!"}}]
[null,null,0.05,0.05,null,null,null,null,"B10"]
[null,null,0.6,0.3,null,null,null,null,"B16"]
[null,null,1.7,1.3,null,null,null,null,"C4"]
[null,null,2.2000000000000002,4.2,null,null,null,null,"C6"]
[null,null,null,null,null,null,null,null,"C10"]
[null,null,null,null,null,null,null,null,"C16"]
[6.8000000000000005E-2,null,0.112,null,0.17899999999999999,null,8.2000000000000003E-2,null,0.128,null,0.22,null,0.34699999999999998]
[5.3999999999999999E-2,null,5.3999999999999999E-2,null,5.3999999999999999E-2,null,5.3999999999999999E-2,null,5.3999999999999999E-2,null,5.3999999999999999E-2,null,5.3999999999999999E-2]
[7,"OFF",11,"OFF",17,"OFF",4.3,"OFF",7,"OFF",11,"OFF",17,"OFF"]
[7.5,2,12,3,19,4,5.5,1.3,8,2,12,3,21,4]
[8,2.5,13,3.5,21,5,6.5,1.6,9,2.5,14,3.5,25,5]
[8.5,3,14,4,23,6,7,2,11,3,16,4,28,6]
[9,3.5,15,5,25,7,8.5,2.2999999999999998,12,3.5,21,5,34,7]
[9.5,4,16,6,28,8,10,2.6,14,4,25,6,38,8]
[10,4.5,17,7,29,10,11,3,16,4.5,28,7,43,10]
[11,5,19,8,31,12,13,3.3,18,5,34,8,57,12]
[12,5.5,21,9,34,14,14.5,3.6,21,5.5,38,9,64,14]
[13,6,22,10,35,16,17,4,25,6,43,10,68,16]
[{"$f":"A11*1.5","v":10.5},{"$f":"B31","v":20},{"$f":"C11*1.5","v":16.5},{"$f":"D31","v":33},{"$f":"E11*1.5","v":25.5},{"$f":"F31","v":52.5},{"$f":"G11*1.5","v":6.4499999999999993},{"$f":"H31","v":25.5},{"$f":"I11*1.5","v":10.5},{"$f":"J31","v":37.5},{"$f":"K11*1.5","v":16.5},{"$f":"L31","v":64.5},{"$f":"M11*1.5","v":25.5},{"$f":"N31","v":102}]
[11.25,{"$f":"B12","v":2},18,{"$f":"D12","v":3},28.5,{"$f":"F12","v":4},8.25,{"$f":"H12","v":1.3},12,{"$f":"J12","v":2},18,{"$f":"L12","v":3},31.5,{"$f":"N12","v":4}]
[12,2.5,19.5,3.5,31.5,5,9.75,1.6,13.5,2.5,21,3.5,37.5,5]
[12.75,3,21,4,34.5,6,10.5,2,16.5,3,24,4,42,6]
[13.5,3.5,22.5,5,37.5,7,12.75,2.2999999999999998,18,3.5,31.5,5,51,7]
[14.25,4,24,6,42,8,15,2.6,21,4,37.5,6,57,8]
[15,4.5,25.5,7,43.5,10,16.5,3,24,4.5,42,7,64.5,10]
[16.5,5,28.5,8,46.5,12,19.5,3.3,27,5,51,8,85.5,12]
[18,5.5,31.5,9,51,14,21.75,3.6,31.5,5.5,57,9,96,14]
[19.5,6,33,10,52.5,16,25.5,4,37.5,6,64.5,10,102,16]
[20,20,{"$f":"C30","v":33},{"$f":"C30","v":33},{"$f":"E30","v":52.5},{"$f":"E30","v":52.5},{"$f":"G30","v":25.5},{"$f":"G30","v":25.5},{"$f":"I30","v":37.5},{"$f":"I30","v":37.5},{"$f":"K30","v":64.5},{"$f":"K30","v":64.5},{"$f":"M30","v":102},{"$f":"M30","v":102}]
[{"$f":"CHOOSE($G$2,A21,A22,A23,A24,A25,A26,A27,A28,A29,A30)","v":{"$error":"#VALUE!"}},{"$f":"CHOOSE($H$2,B21,B22,B23,B24,B25,B26,B27,B28,B29,B30)","v":{"$error":"#VALUE!"}},{"$f":"CHOOSE($G$2,C21,C22,C23,C24,C25,C26,C27,C28,C29,C30)","v":{"$error":"#VALUE!"}},{"$f":"CHOOSE($H$2,D21,D22,D23,D24,D25,D26,D27,D28,D29,D30)","v":{"$error":"#VALUE!"}},{"$f":"CHOOSE($G$2,E21,E22,E23,E24,E25,E26,E27,E28,E29,E30)","v":{"$error":"#VALUE!"}},{"$f":"CHOOSE($H$2,F21,F22,F23,F24,F25,F26,F27,F28,F29,F30)","v":{"$error":"#VALUE!"}},{"$f":"CHOOSE($G$2,G21,G22,G23,G24,G25,G26,G27,G28,G29,G30)","v":{"$error":"#VALUE!"}},{"$f":"CHOOSE($H$2,H21,H22,H23,H24,H25,H26,H27,H28,H29,H30)","v":{"$error":"#VALUE!"}},{"$f":"CHOOSE($G$2,I21,I22,I23,I24,I25,I26,I27,I28,I29,I30)","v":{"$error":"#VALUE!"}},{"$f":"CHOOSE($H$2,J21,J22,J23,J24,J25,J26,J27,J28,J29,J30)","v":{"$error":"#VALUE!"}},{"$f":"CHOOSE($G$2,K21,K22,K23,K24,K25,K26,K27,K28,K29,K30)","v":{"$error":"#VALUE!"}},{"$f":"CHOOSE($H$2,L21,L22,L23,L24,L25,L26,L27,L28,L29,L30)","v":{"$error":"#VALUE!"}},{"$f":"CHOOSE($G$2,M21,M22,M23,M24,M25,M26,M27,M28,M29,M30)","v":{"$error":"#VALUE!"}},{"$f":"CHOOSE($H$2,N21,N22,N23,N24,N25,N26,N27,N28,N29,N30)","v":{"$error":"#VALUE!"}}]
[{"$f":"IF($F$2=1,TRUE,FALSE)","v":false},null,{"$f":"IF($F$2=2,TRUE,FALSE)","v":false},null,{"$f":"IF($F$2=3,TRUE,FALSE)","v":false},null,{"$f":"IF($F$2=4,TRUE,FALSE)","v":false},null,{"$f":"IF($F$2=5,TRUE,FALSE)","v":false},null,{"$f":"IF($F$2=6,TRUE,FALSE)","v":false},null,{"$f":"IF($F$2=7,TRUE,FALSE)","v":false}]
[{"$f":"B32*(1+$C$3)","v":{"$error":"#VALUE!"}},null,{"$f":"D32*(1+$C$3)","v":{"$error":"#VALUE!"}},null,{"$f":"F32*(1+$C$3)","v":{"$error":"#VALUE!"}},null,{"$f":"H32*(1+$C$3)","v":{"$error":"#VALUE!"}},null,{"$f":"J32*(1+$C$3)","v":{"$error":"#VALUE!"}},null,{"$f":"L32*(1+$C$3)","v":{"$error":"#VALUE!"}},null,{"$f":"N32*(1+$C$3)","v":{"$error":"#VALUE!"}}]
[{"$f":"B$32+(A$32-B$32)*$C4","v":{"$error":"#VALUE!"}},null,{"$f":"D$32+(C$32-D$32)*$C4","v":{"$error":"#VALUE!"}},null,{"$f":"F$32+(E$32-F$32)*$C4","v":{"$error":"#VALUE!"}},null,{"$f":"H$32+(G$32-H$32)*$C4","v":{"$error":"#VALUE!"}},null,{"$f":"J$32+(I$32-J$32)*$C4","v":{"$error":"#VALUE!"}},null,{"$f":"L$32+(K$32-L$32)*$C4","v":{"$error":"#VALUE!"}},null,{"$f":"N$32+(M$32-N$32)*$C4","v":{"$error":"#VALUE!"}}]
[{"$f":"B$32+(A$32-B$32)*$C5","v":{"$error":"#VALUE!"}},null,{"$f":"D$32+(C$32-D$32)*$C5","v":{"$error":"#VALUE!"}},null,{"$f":"F$32+(E$32-F$32)*$C5","v":{"$error":"#VALUE!"}},null,{"$f":"H$32+(G$32-H$32)*$C5","v":{"$error":"#VALUE!"}},null,{"$f":"J$32+(I$32-J$32)*$C5","v":{"$error":"#VALUE!"}},null,{"$f":"L$32+(K$32-L$32)*$C5","v":{"$error":"#VALUE!"}},null,{"$f":"N$32+(M$32-N$32)*$C5","v":{"$error":"#VALUE!"}}]
[{"$f":"B$32+(A$32-B$32)*$C6","v":{"$error":"#VALUE!"}},null,{"$f":"D$32+(C$32-D$32)*$C6","v":{"$error":"#VALUE!"}},null,{"$f":"F$32+(E$32-F$32)*$C6","v":{"$error":"#VALUE!"}},null,{"$f":"H$32+(G$32-H$32)*$C6","v":{"$error":"#VALUE!"}},null,{"$f":"J$32+(I$32-J$32)*$C6","v":{"$error":"#VALUE!"}},null,{"$f":"L$32+(K$32-L$32)*$C6","v":{"$error":"#VALUE!"}},null,{"$f":"N$32+(M$32-N$32)*$C6","v":{"$error":"#VALUE!"}}]
[{"$f":"A32","v":{"$error":"#VALUE!"}},null,{"$f":"C32","v":{"$error":"#VALUE!"}},null,{"$f":"E32","v":{"$error":"#VALUE!"}},null,{"$f":"G32","v":{"$error":"#VALUE!"}},null,{"$f":"I32","v":{"$error":"#VALUE!"}},null,{"$f":"K32","v":{"$error":"#VALUE!"}},null,{"$f":"M32","v":{"$error":"#VALUE!"}}]
[{"$f":"A44*(1-A$10)","v":{"$error":"#VALUE!"}},{"$f":"A44*(1+A$10)","v":{"$error":"#VALUE!"}},{"$f":"C44*(1-C$10)","v":{"$error":"#VALUE!"}},{"$f":"C44*(1+C$10)","v":{"$error":"#VALUE!"}},{"$f":"E44*(1-E$10)","v":{"$error":"#VALUE!"}},{"$f":"E44*(1+E$10)","v":{"$error":"#VALUE!"}},{"$f":"G44*(1-G$10)","v":{"$error":"#VALUE!"}},{"$f":"G44*(1+G$10)","v":{"$error":"#VALUE!"}},{"$f":"I44*(1-I$10)","v":{"$error":"#VALUE!"}},{"$f":"I44*(1+I$10)","v":{"$error":"#VALUE!"}},{"$f":"K44*(1-K$10)","v":{"$error":"#VALUE!"}},{"$f":"K44*(1+K$10)","v":{"$error":"#VALUE!"}},{"$f":"M44*(1-M$10)","v":{"$error":"#VALUE!"}},{"$f":"M44*(1+M$10)","v":{"$error":"#VALUE!"}}]
[{"$f":"A45*(1-A$10)","v":{"$error":"#VALUE!"}},{"$f":"A45*(1+A$10)","v":{"$error":"#VALUE!"}},{"$f":"C45*(1-C$10)","v":{"$error":"#VALUE!"}},{"$f":"C45*(1+C$10)","v":{"$error":"#VALUE!"}},{"$f":"E45*(1-E$10)","v":{"$error":"#VALUE!"}},{"$f":"E45*(1+E$10)","v":{"$error":"#VALUE!"}},{"$f":"G45*(1-G$10)","v":{"$error":"#VALUE!"}},{"$f":"G45*(1+G$10)","v":{"$error":"#VALUE!"}},{"$f":"I45*(1-I$10)","v":{"$error":"#VALUE!"}},{"$f":"I45*(1+I$10)","v":{"$error":"#VALUE!"}},{"$f":"K45*(1-K$10)","v":{"$error":"#VALUE!"}},{"$f":"K45*(1+K$10)","v":{"$error":"#VALUE!"}},{"$f":"M45*(1-M$10)","v":{"$error":"#VALUE!"}},{"$f":"M45*(1+M$10)","v":{"$error":"#VALUE!"}}]
[{"$f":"A46*(1-A$10)","v":{"$error":"#VALUE!"}},{"$f":"A46*(1+A$10)","v":{"$error":"#VALUE!"}},{"$f":"C46*(1-C$10)","v":{"$error":"#VALUE!"}},{"$f":"C46*(1+C$10)","v":{"$error":"#VALUE!"}},{"$f":"E46*(1-E$10)","v":{"$error":"#VALUE!"}},{"$f":"E46*(1+E$10)","v":{"$error":"#VALUE!"}},{"$f":"G46*(1-G$10)","v":{"$error":"#VALUE!"}},{"$f":"G46*(1+G$10)","v":{"$error":"#VALUE!"}},{"$f":"I46*(1-I$10)","v":{"$error":"#VALUE!"}},{"$f":"I46*(1+I$10)","v":{"$error":"#VALUE!"}},{"$f":"K46*(1-K$10)","v":{"$error":"#VALUE!"}},{"$f":"K46*(1+K$10)","v":{"$error":"#VALUE!"}},{"$f":"M46*(1-M$10)","v":{"$error":"#VALUE!"}},{"$f":"M46*(1+M$10)","v":{"$error":"#VALUE!"}}]
[{"$f":"A48*(1-A$10)-A$9","v":{"$error":"#VALUE!"}},{"$f":"A48*(1+A$10)+A$9","v":{"$error":"#VALUE!"}},{"$f":"C48*(1-C$10)-C$9","v":{"$error":"#VALUE!"}},{"$f":"C48*(1+C$10)+C$9","v":{"$error":"#VALUE!"}},{"$f":"E48*(1-E$10)-E$9","v":{"$error":"#VALUE!"}},{"$f":"E48*(1+E$10)+E$9","v":{"$error":"#VALUE!"}},{"$f":"G47*(1-G$10)","v":{"$error":"#VALUE!"}},{"$f":"G47*(1+G$10)","v":{"$error":"#VALUE!"}},{"$f":"I47*(1-I$10)","v":{"$error":"#VALUE!"}},{"$f":"I47*(1+I$10)","v":{"$error":"#VALUE!"}},{"$f":"K47*(1-K$10)","v":{"$error":"#VALUE!"}},{"$f":"K47*(1+K$10)","v":{"$error":"#VALUE!"}},{"$f":"M47*(1-M$10)","v":{"$error":"#VALUE!"}},{"$f":"M47*(1+M$10)","v":{"$error":"#VALUE!"}}]
[{"$f":"A48*(1-A$10)-A$9","v":{"$error":"#VALUE!"}},{"$f":"A48*(1+A$10)+A$9","v":{"$error":"#VALUE!"}},{"$f":"C48*(1-C$10)-C$9","v":{"$error":"#VALUE!"}},{"$f":"C48*(1+C$10)+C$9","v":{"$error":"#VALUE!"}},{"$f":"E48*(1-E$10)-E$9","v":{"$error":"#VALUE!"}},{"$f":"E48*(1+E$10)+E$9","v":{"$error":"#VALUE!"}},{"$f":"G48*(1-G$10)-G$9","v":{"$error":"#VALUE!"}},{"$f":"G48*(1+G$10)+G$9","v":{"$error":"#VALUE!"}},{"$f":"I48*(1-I$10)-I$9","v":{"$error":"#VALUE!"}},{"$f":"I48*(1+I$10)+I$9","v":{"$error":"#VALUE!"}},{"$f":"K48*(1-K$10)-K$9","v":{"$error":"#VALUE!"}},{"$f":"K48*(1+K$10)+K$9","v":{"$error":"#VALUE!"}},{"$f":"M48*(1-M$10)-M$9","v":{"$error":"#VALUE!"}},{"$f":"M48*(1+M$10)+M$9","v":{"$error":"#VALUE!"}}]
[{"$f":"(B$32*(1+$C3)/(1-A$10))","v":{"$error":"#VALUE!"}},null,{"$f":"(D$32*(1+$C3)/(1-C$10))","v":{"$error":"#VALUE!"}},null,{"$f":"(F$32*(1+$C3)/(1-E$10))","v":{"$error":"#VALUE!"}},null,{"$f":"(H$32*(1+$D3)/(1-G$10))","v":{"$error":"#VALUE!"}},null,{"$f":"(J$32*(1+$D3)/(1-I$10))","v":{"$error":"#VALUE!"}},null,{"$f":"(L$32*(1+$D3)/(1-K$10))","v":{"$error":"#VALUE!"}},null,{"$f":"(N$32*(1+$D3)/(1-M$10))","v":{"$error":"#VALUE!"}}]
[{"$f":"(B$32*(1+$C4)/(1-A$10))","v":{"$error":"#VALUE!"}},null,{"$f":"(D$32*(1+$C4)/(1-C$10))","v":{"$error":"#VALUE!"}},null,{"$f":"(F$32*(1+$C4)/(1-E$10))","v":{"$error":"#VALUE!"}},null,{"$f":"(H$32*(1+$D4)/(1-G$10))","v":{"$error":"#VALUE!"}},null,{"$f":"(J$32*(1+$D4)/(1-I$10))","v":{"$error":"#VALUE!"}},null,{"$f":"(L$32*(1+$D4)/(1-K$10))","v":{"$error":"#VALUE!"}},null,{"$f":"(N$32*(1+$D4)/(1-M$10))","v":{"$error":"#VALUE!"}}]
[{"$f":"(B$32*(1+$C5)/(1-A$10))","v":{"$error":"#VALUE!"}},null,{"$f":"(D$32*(1+$C5)/(1-C$10))","v":{"$error":"#VALUE!"}},null,{"$f":"(F$32*(1+$C5)/(1-E$10))","v":{"$error":"#VALUE!"}},null,{"$f":"(H$32*(1+$D5)/(1-G$10))","v":{"$error":"#VALUE!"}},null,{"$f":"(J$32*(1+$D5)/(1-I$10))","v":{"$error":"#VALUE!"}},null,{"$f":"(L$32*(1+$D5)/(1-K$10))","v":{"$error":"#VALUE!"}},null,{"$f":"(N$32*(1+$D5)/(1-M$10))","v":{"$error":"#VALUE!"}}]
[{"$f":"A48","v":{"$error":"#VALUE!"}},null,{"$f":"C48","v":{"$error":"#VALUE!"}},null,{"$f":"E48","v":{"$error":"#VALUE!"}},null,{"$f":"(H$32*(1+$D6)/(1-G$10))","v":{"$error":"#VALUE!"}},null,{"$f":"(J$32*(1+$D6)/(1-I$10))","v":{"$error":"#VALUE!"}},null,{"$f":"(L$32*(1+$D6)/(1-K$10))","v":{"$error":"#VALUE!"}},null,{"$f":"(N$32*(1+$D6)/(1-M$10))","v":{"$error":"#VALUE!"}}]
[{"$f":"(A$32/(1+A$10)-A$9)","v":{"$error":"#VALUE!"}},{"$f":"A43*(1+2*A$10)+2*A$9","v":{"$error":"#VALUE!"}},{"$f":"(C$32/(1+C$10)-C$9)","v":{"$error":"#VALUE!"}},{"$f":"C43*(1+2*C$10)+2*C$9","v":{"$error":"#VALUE!"}},{"$f":"(E$32/(1+E$10)-E$9)","v":{"$error":"#VALUE!"}},{"$f":"E43*(1+2*E$10)+2*E$9","v":{"$error":"#VALUE!"}},{"$f":"(G$32/(1+G$10)-G$9)","v":{"$error":"#VALUE!"}},{"$f":"G43*(1+2*G$10)+2*G$9","v":{"$error":"#VALUE!"}},{"$f":"(I$32/(1+I$10)-I$9)","v":{"$error":"#VALUE!"}},{"$f":"I43*(1+2*I$10)+2*I$9","v":{"$error":"#VALUE!"}},{"$f":"(K$32/(1+K$10)-K$9)","v":{"$error":"#VALUE!"}},{"$f":"K43*(1+2*K$10)+2*K$9","v":{"$error":"#VALUE!"}},{"$f":"(M$32/(1+M$10)-M$9)","v":{"$error":"#VALUE!"}},{"$f":"M43*(1+2*M$10)+2*M$9","v":{"$error":"#VALUE!"}}]
[{"$f":"A39*A$33+C39*C$33+E39*E$33+G39*G$33+I39*I$33+K39*K$33+M39*M$33","v":{"$error":"#VALUE!"}},{"$f":"B39*A$33+D39*C$33+F39*E$33+H39*G$33+J39*I$33+L39*K$33+N39*M$33","v":{"$error":"#VALUE!"}}]
[{"$f":"A40*A$33+C40*C$33+E40*E$33+G40*G$33+I40*I$33+K40*K$33+M40*M$33","v":{"$error":"#VALUE!"}},{"$f":"B40*A$33+D40*C$33+F40*E$33+H40*G$33+J40*I$33+L40*K$33+N40*M$33","v":{"$error":"#VALUE!"}}]
[{"$error":"#VALUE!"},{"$error":"#VALUE!"}]
[{"$error":"#VALUE!"},{"$error":"#VALUE!"}]
[{"$f":"IF((A43*A$33+C43*C$33+E43*E$33+G43*G$33+I43*I$33+K43*K$33+M43*M$33)>0,A43*A$33+C43*C$33+E43*E$33+G43*G$33+I43*I$33+K43*K$33+M43*M$33,0.001)","v":{"$error":"#VALUE!"}},{"$f":"IF(B43*A$33+D43*C$33+F43*E$33+H43*G$33+J43*I$33+L43*K$33+N43*M$33>0,B43*A$33+D43*C$33+F43*E$33+H43*G$33+J43*I$33+L43*K$33+N43*M$33,0.001)","v":{"$error":"#VALUE!"}}]
[{"$f":"D54*($G$33+$I$33+$K$33+$M$33)+C54*($A$33+$C$33+$E$33)+0.000001","v":9.9999999999999995E-7},{"$f":"IFERROR(IF(A49>A53,A53,A49),0.001)","v":1E-3},10000,10000]
[{"$f":"D55*($G$33+$I$33+$K$33+$M$33)+C55*($A$33+$C$33+$E$33)+0.000001","v":9.9999999999999995E-7},{"$f":"IFERROR(IF(A49>A53,A53,A49),0.001)","v":1E-3},9000,9000]
[{"$f":"D56*($G$33+$I$33+$K$33+$M$33)+C56*($A$33+$C$33+$E$33)+0.000001","v":9.9999999999999995E-7},{"$f":"IFERROR(IF(A49>A53,A53,A49),0.001)","v":1E-3},90,270]
[{"$f":"IFERROR(((A49+B49)/(A50+B50))*(D57*($G$33+$I$33+$K$33+$M$33)+C57*($A$33+$C$33+$E$33))-0.1*(D57*($G$33+$I$33+$K$33+$M$33)+C57*($A$33+$C$33+$E$33)),0.001)","v":1E-3},{"$f":"IFERROR(IF(A50>A53,A53,A50),0.001)","v":1E-3},90,270]
[{"$f":"D58*($G$33+$I$33+$K$33+$M$33)+C58*($A$33+$C$33+$E$33)+0.000001","v":9.9999999999999995E-7},{"$f":"IFERROR(IF(A50>A53,A53,A50),0.001)","v":1E-3},9,27]
[{"$f":"((B71+B58)/(B60+B69))*(D59*($G$33+$I$33+$K$33+$M$33)+C59*($A$33+$C$33+$E$33))-0.1*(D59*($G$33+$I$33+$K$33+$M$33)+C59*($A$33+$C$33+$E$33))+0.000001","v":9.9999999999999995E-7},{"$f":"IFERROR(IF(A51>A53,A53,A51),0.001)","v":1E-3},9,27]
[{"$f":"D60*($G$33+$I$33+$K$33+$M$33)+C60*($A$33+$C$33+$E$33)+0.000001","v":9.9999999999999995E-7},{"$f":"IFERROR(IF(A51>A53,A53,A51),0.001)","v":1E-3},0.9,2.7]
[{"$f":"((B60+B69)/(B62+B67))*(D61*($G$33+$I$33+$K$33+$M$33)+C61*($A$33+$C$33+$E$33))-0.1*(D61*($G$33+$I$33+$K$33+$M$33)+C61*($A$33+$C$33+$E$33))+0.000001","v":9.9999999999999995E-7},{"$f":"IFERROR(IF(A52>A53,A53,A52),0.001)","v":1E-3},0.9,2.7]
[{"$f":"D62*($G$33+$I$33+$K$33+$M$33)+C62*($A$33+$C$33+$E$33)+0.000001","v":9.9999999999999995E-7},{"$f":"IFERROR(IF(A52>A53,A53,A52),0.001)","v":1E-3},0.09,0.27]
[{"$f":"IFERROR(((A52+B52)/(A53+B53))*(D63*($G$33+$I$33+$K$33+$M$33)+C63*($A$33+$C$33+$E$33))-0.1*(D63*($G$33+$I$33+$K$33+$M$33)+C63*($A$33+$C$33+$E$33)),0.001)","v":1E-3},{"$f":"IFERROR(A53,0.001)","v":1E-3},0.09,0.27]
[{"$f":"D64*($G$33+$I$33+$K$33+$M$33)+C64*($A$33+$C$33+$E$33)+0.000001","v":9.9999999999999995E-7},{"$f":"IFERROR(A53,0.001)","v":1E-3},1E-3,1E-3]
[{"$f":"D65*($G$33+$I$33+$K$33+$M$33)+C65*($A$33+$C$33+$E$33)+0.000001","v":9.9999999999999995E-7},{"$f":"IFERROR(B53,0.001)","v":1E-3},1E-3,1E-3]
[{"$f":"IFERROR(((A52+B52)/(A53+B53))*(D66*($G$33+$I$33+$K$33+$M$33)+C66*($A$33+$C$33+$E$33))+0.1*(D66*($G$33+$I$33+$K$33+$M$33)+C66*($A$33+$C$33+$E$33)),0.001)","v":1E-3},{"$f":"IFERROR(B53,0.001)","v":1E-3},0.11,0.33]
[{"$f":"D67*($G$33+$I$33+$K$33+$M$33)+C67*($A$33+$C$33+$E$33)+0.000001","v":9.9999999999999995E-7},{"$f":"IFERROR(IF(B52>B53,B53,B52),0.001)","v":1E-3},0.11,0.33]
[{"$f":"((B69+B60)/(B67+B62))*(D68*($G$33+$I$33+$K$33+$M$33)+C68*($A$33+$C$33+$E$33))+0.1*(D68*($G$33+$I$33+$K$33+$M$33)+C68*($A$33+$C$33+$E$33))+0.000001","v":9.9999999999999995E-7},{"$f":"IFERROR(IF(B52>B53,B53,B52),0.001)","v":1E-3},1.1000000000000001,3.3]
[{"$f":"D69*($G$33+$I$33+$K$33+$M$33)+C69*($A$33+$C$33+$E$33)+0.000001","v":9.9999999999999995E-7},{"$f":"IFERROR(IF(B51>B53,B53,B51),0.001)","v":1E-3},1.1000000000000001,3.3]
[{"$f":"((B71+B58)/(B60+B69))*(D70*($G$33+$I$33+$K$33+$M$33)+C70*($A$33+$C$33+$E$33))+0.1*(D70*($G$33+$I$33+$K$33+$M$33)+C70*($A$33+$C$33+$E$33))+0.000001","v":9.9999999999999995E-7},{"$f":"IFERROR(IF(B51>B53,B53,B51),0.001)","v":1E-3},11,33]
[{"$f":"D71*($G$33+$I$33+$K$33+$M$33)+C71*($A$33+$C$33+$E$33)+0.000001","v":9.9999999999999995E-7},{"$f":"IFERROR(IF(B50>B53,B53,B50),0.001)","v":1E-3},11,33]
[{"$f":"IFERROR(((A49+B49)/(A50+B50))*(D72*($G$33+$I$33+$K$33+$M$33)+C72*($A$33+$C$33+$E$33))+0.1*(D72*($G$33+$I$33+$K$33+$M$33)+C72*($A$33+$C$33+$E$33)),0.001)","v":1E-3},{"$f":"IFERROR(IF(B50>B53,B53,B50),0.001)","v":1E-3},110,330]
[{"$f":"D73*($G$33+$I$33+$K$33+$M$33)+C73*($A$33+$C$33+$E$33)+0.000001","v":9.9999999999999995E-7},{"$f":"IFERROR(IF(B49>B53,B53,B49),0.001)","v":1E-3},110,330]
[{"$f":"D74*($G$33+$I$33+$K$33+$M$33)+C74*($A$33+$C$33+$E$33)+0.000001","v":9.9999999999999995E-7},{"$f":"IFERROR(IF(B49>B53,B53,B49),0.001)","v":1E-3},10000,10000]

{"sheet":"LSS","index":3,"n_rows":93,"n_cols":11,"rows_kept":93,"cut":false,"hidden":true,"merged":[]}
[]
[null,{"$f":"(Berechnung!$A$33*Berechnung!$B$30+Berechnung!$C$33*Berechnung!$D$30+Berechnung!$E$33*Berechnung!$F$30+Berechnung!$G$33*Berechnung!$H$30+Berechnung!$I$33*Berechnung!$J$30+Berechnung!$K$33*Berechnung!$L$30+Berechnung!$M$33*Berechnung!$N$30)*E2*$H$2+0.001","v":1E-3},{"$f":"F2","v":9999},null,1.0517941336950001,9999,null,{"$f":"(Berechnung!A33+Berechnung!C33+Berechnung!E33)","v":0},null,true]
[null,{"$f":"(Berechnung!$A$33*Berechnung!$B$30+Berechnung!$C$33*Berechnung!$D$30+Berechnung!$E$33*Berechnung!$F$30+Berechnung!$G$33*Berechnung!$H$30+Berechnung!$I$33*Berechnung!$J$30+Berechnung!$K$33*Berechnung!$L$30+Berechnung!$M$33*Berechnung!$N$30)*E3*$H$2+0.001","v":1E-3},{"$f":"F3","v":4009.5139155249999},null,1.051741373971,4009.5139155249999,null,null,null,{"$f":"IF(ISNUMBER(Übersicht!$H$14),Übersicht!$H$14,0.001)","v":1E-3},{"$f":"10000*J2","v":10000}]
[null,{"$f":"(Berechnung!$A$33*Berechnung!$B$30+Berechnung!$C$33*Berechnung!$D$30+Berechnung!$E$33*Berechnung!$F$30+Berechnung!$G$33*Berechnung!$H$30+Berechnung!$I$33*Berechnung!$J$30+Berechnung!$K$33*Berechnung!$L$30+Berechnung!$M$33*Berechnung!$N$30)*E4*$H$2+0.001","v":1E-3},996.52761345529996,null,1.092564842224,996.52761345529996,null,null,null,{"$f":"IF(ISNUMBER(Übersicht!$H$14),Übersicht!$H$14,0.001)","v":1E-3},{"$f":"1*J2","v":1}]
[null,{"$f":"(Berechnung!$A$33*Berechnung!$B$30+Berechnung!$C$33*Berechnung!$D$30+Berechnung!$E$33*Berechnung!$F$30+Berechnung!$G$33*Berechnung!$H$30+Berechnung!$I$33*Berechnung!$J$30+Berechnung!$K$33*Berechnung!$L$30+Berechnung!$M$33*Berechnung!$N$30)*E5*$H$2+0.001","v":1E-3},300.63812802059999,null,1.145863560525,300.63812802059999,null,null,null,{"$f":"IF(ISNUMBER(Übersicht!$H$11),Übersicht!$H$11,Übersicht!$H$14+0.001)","v":1E-3},{"$f":"0.01*J2","v":0.01}]
[null,{"$f":"(Berechnung!$A$33*Berechnung!$B$30+Berechnung!$C$33*Berechnung!$D$30+Berechnung!$E$33*Berechnung!$F$30+Berechnung!$G$33*Berechnung!$H$30+Berechnung!$I$33*Berechnung!$J$30+Berechnung!$K$33*Berechnung!$L$30+Berechnung!$M$33*Berechnung!$N$30)*E6*$H$2+0.001","v":1E-3},146.479514303,null,1.204663299331,146.479514303,null,null,null,{"$f":"IF(ISNUMBER(Übersicht!$H$11),Übersicht!$H$11,Übersicht!$H$14+0.001)","v":1E-3},{"$f":"0.001*J2","v":1E-3}]
[null,{"$f":"(Berechnung!$A$33*Berechnung!$B$30+Berechnung!$C$33*Berechnung!$D$30+Berechnung!$E$33*Berechnung!$F$30+Berechnung!$G$33*Berechnung!$H$30+Berechnung!$I$33*Berechnung!$J$30+Berechnung!$K$33*Berechnung!$L$30+Berechnung!$M$33*Berechnung!$N$30)*E7*$H$2+0.001","v":1E-3},69.92799576569,null,1.3001418489500001,69.92799576569]
[null,{"$f":"(Berechnung!$A$33*Berechnung!$B$30+Berechnung!$C$33*Berechnung!$D$30+Berechnung!$E$33*Berechnung!$F$30+Berechnung!$G$33*Berechnung!$H$30+Berechnung!$I$33*Berechnung!$J$30+Berechnung!$K$33*Berechnung!$L$30+Berechnung!$M$33*Berechnung!$N$30)*E8*$H$2+0.001","v":1E-3},42.641157692599997,null,1.3898847158580001,42.641157692599997]
[null,{"$f":"(Berechnung!$A$33*Berechnung!$B$30+Berechnung!$C$33*Berechnung!$D$30+Berechnung!$E$33*Berechnung!$F$30+Berechnung!$G$33*Berechnung!$H$30+Berechnung!$I$33*Berechnung!$J$30+Berechnung!$K$33*Berechnung!$L$30+Berechnung!$M$33*Berechnung!$N$30)*E9*$H$2+0.001","v":1E-3},26.537837862149999,null,1.507236989536,26.537837862149999]
[null,{"$f":"(Berechnung!$A$33*Berechnung!$B$30+Berechnung!$C$33*Berechnung!$D$30+Berechnung!$E$33*Berechnung!$F$30+Berechnung!$G$33*Berechnung!$H$30+Berechnung!$I$33*Berechnung!$J$30+Berechnung!$K$33*Berechnung!$L$30+Berechnung!$M$33*Berechnung!$N$30)*E10*$H$2+0.001","v":1E-3},10.01994484664,null,1.867979089513,10.01994484664]
[null,{"$f":"(Berechnung!$A$33*Berechnung!$B$30+Berechnung!$C$33*Berechnung!$D$30+Berechnung!$E$33*Berechnung!$F$30+Berechnung!$G$33*Berechnung!$H$30+Berechnung!$I$33*Berechnung!$J$30+Berechnung!$K$33*Berechnung!$L$30+Berechnung!$M$33*Berechnung!$N$30)*E11*$H$2+0.001","v":1E-3},4.7348933269740003,null,2.3040738203109998,4.7348933269740003]
[null,{"$f":"(Berechnung!$A$33*Berechnung!$B$30+Berechnung!$C$33*Berechnung!$D$30+Berechnung!$E$33*Berechnung!$F$30+Berechnung!$G$33*Berechnung!$H$30+Berechnung!$I$33*Berechnung!$J$30+Berechnung!$K$33*Berechnung!$L$30+Berechnung!$M$33*Berechnung!$N$30)*E12*$H$2+0.001","v":1E-3},2.3908132674110001,null,2.8760794179069999,2.3908132674110001]
[null,{"$f":"(Berechnung!$A$33*Berechnung!$B$30+Berechnung!$C$33*Berechnung!$D$30+Berechnung!$E$33*Berechnung!$F$30+Berechnung!$G$33*Berechnung!$H$30+Berechnung!$I$33*Berechnung!$J$30+Berechnung!$K$33*Berechnung!$L$30+Berechnung!$M$33*Berechnung!$N$30)*E13*$H$2+0.001","v":1E-3},2.01023667174,null,3.045465715063,2.01023667174]
[null,{"$f":"(Berechnung!$A$33*Berechnung!$B$30+Berechnung!$C$33*Berechnung!$D$30+Berechnung!$E$33*Berechnung!$F$30+Berechnung!$G$33*Berechnung!$H$30+Berechnung!$I$33*Berechnung!$J$30+Berechnung!$K$33*Berechnung!$L$30+Berechnung!$M$33*Berechnung!$N$30)*E14*$H$2+0.001","v":1E-3},1.7250725656649999,null,3.1189409224090001,1.7250725656649999]
[null,{"$f":"(Berechnung!$A$33*Berechnung!$B$30+Berechnung!$C$33*Berechnung!$D$30+Berechnung!$E$33*Berechnung!$F$30+Berechnung!$G$33*Berechnung!$H$30+Berechnung!$I$33*Berechnung!$J$30+Berechnung!$K$33*Berechnung!$L$30+Berechnung!$M$33*Berechnung!$N$30)*E15*$H$2+0.001","v":1E-3},1.510866837137,null,3.1563309525180001,1.510866837137]
[null,{"$f":"(Berechnung!$A$33*Berechnung!$B$30+Berechnung!$C$33*Berechnung!$D$30+Berechnung!$E$33*Berechnung!$F$30+Berechnung!$G$33*Berechnung!$H$30+Berechnung!$I$33*Berechnung!$J$30+Berechnung!$K$33*Berechnung!$L$30+Berechnung!$M$33*Berechnung!$N$30)*E16*$H$2+0.001","v":1E-3},1.068142651422,null,3.201758292948,1.068142651422]
[null,{"$f":"(Berechnung!$A$33*Berechnung!$B$30+Berechnung!$C$33*Berechnung!$D$30+Berechnung!$E$33*Berechnung!$F$30+Berechnung!$G$33*Berechnung!$H$30+Berechnung!$I$33*Berechnung!$J$30+Berechnung!$K$33*Berechnung!$L$30+Berechnung!$M$33*Berechnung!$N$30)*E17*$H$2+0.001","v":1E-3},2.5950250966220001E-2,null,3.2011078905830002,2.5950250966220001E-2]
[null,{"$f":"(Berechnung!$A$33*Berechnung!$B$30+Berechnung!$C$33*Berechnung!$D$30+Berechnung!$E$33*Berechnung!$F$30+Berechnung!$G$33*Berechnung!$H$30+Berechnung!$I$33*Berechnung!$J$30+Berechnung!$K$33*Berechnung!$L$30+Berechnung!$M$33*Berechnung!$N$30)*E18*$H$2+0.001","v":1E-3},2.1543013049449999E-2,null,3.2141883265139999,2.1543013049449999E-2]
[null,{"$f":"(Berechnung!$A$33*Berechnung!$B$30+Berechnung!$C$33*Berechnung!$D$30+Berechnung!$E$33*Berechnung!$F$30+Berechnung!$G$33*Berechnung!$H$30+Berechnung!$I$33*Berechnung!$J$30+Berechnung!$K$33*Berechnung!$L$30+Berechnung!$M$33*Berechnung!$N$30)*E19*$H$2+0.001","v":1E-3},1.806760753617E-2,null,3.2488446998909999,1.806760753617E-2]
[null,{"$f":"(Berechnung!$A$33*Berechnung!$B$30+Berechnung!$C$33*Berechnung!$D$30+Berechnung!$E$33*Berechnung!$F$30+Berechnung!$G$33*Berechnung!$H$30+Berechnung!$I$33*Berechnung!$J$30+Berechnung!$K$33*Berechnung!$L$30+Berechnung!$M$33*Berechnung!$N$30)*E20*$H$2+0.001","v":1E-3},1.488481836163E-2,null,3.3351846492849999,1.488481836163E-2]
[null,{"$f":"(Berechnung!$A$33*Berechnung!$B$30+Berechnung!$C$33*Berechnung!$D$30+Berechnung!$E$33*Berechnung!$F$30+Berechnung!$G$33*Berechnung!$H$30+Berechnung!$I$33*Berechnung!$J$30+Berechnung!$K$33*Berechnung!$L$30+Berechnung!$M$33*Berechnung!$N$30)*E21*$H$2+0.001","v":1E-3},1.3339155428160001E-2,null,3.4075394849770002,1.3339155428160001E-2]
[null,{"$f":"(Berechnung!$A$33*Berechnung!$B$30+Berechnung!$C$33*Berechnung!$D$30+Berechnung!$E$33*Berechnung!$F$30+Berechnung!$G$33*Berechnung!$H$30+Berechnung!$I$33*Berechnung!$J$30+Berechnung!$K$33*Berechnung!$L$30+Berechnung!$M$33*Berechnung!$N$30)*E22*$H$2+0.001","v":1E-3},1.15348114883E-2,null,3.565501608001,1.15348114883E-2]
[null,{"$f":"(Berechnung!$A$33*Berechnung!$B$30+Berechnung!$C$33*Berechnung!$D$30+Berechnung!$E$33*Berechnung!$F$30+Berechnung!$G$33*Berechnung!$H$30+Berechnung!$I$33*Berechnung!$J$30+Berechnung!$K$33*Berechnung!$L$30+Berechnung!$M$33*Berechnung!$N$30)*E23*$H$2+0.001","v":1E-3},1.002552975734E-2,null,3.7981330772790001,1.002552975734E-2]
[null,{"$f":"(Berechnung!$A$33*Berechnung!$B$30+Berechnung!$C$33*Berechnung!$D$30+Berechnung!$E$33*Berechnung!$F$30+Berechnung!$G$33*Berechnung!$H$30+Berechnung!$I$33*Berechnung!$J$30+Berechnung!$K$33*Berechnung!$L$30+Berechnung!$M$33*Berechnung!$N$30)*E24*$H$2+0.001","v":1E-3},0.01,null,6.2978609629960003,0.01]
[null,{"$f":"(Berechnung!$A$33*Berechnung!$B$30+Berechnung!$C$33*Berechnung!$D$30+Berechnung!$E$33*Berechnung!$F$30+Berechnung!$G$33*Berechnung!$H$30+Berechnung!$I$33*Berechnung!$J$30+Berechnung!$K$33*Berechnung!$L$30+Berechnung!$M$33*Berechnung!$N$30)*E25*$H$2+0.001","v":1E-3},1.031069557823E-2,null,6.0116353146070001,1.031069557823E-2]
[null,{"$f":"(Berechnung!$A$33*Berechnung!$B$30+Berechnung!$C$33*Berechnung!$D$30+Berechnung!$E$33*Berechnung!$F$30+Berechnung!$G$33*Berechnung!$H$30+Berechnung!$I$33*Berechnung!$J$30+Berechnung!$K$33*Berechnung!$L$30+Berechnung!$M$33*Berechnung!$N$30)*E26*$H$2+0.001","v":1E-3},1.0740023970319999E-2,null,5.8003504707209999,1.0740023970319999E-2]
[null,{"$f":"(Berechnung!$A$33*Berechnung!$B$30+Berechnung!$C$33*Berechnung!$D$30+Berechnung!$E$33*Berechnung!$F$30+Berechnung!$G$33*Berechnung!$H$30+Berechnung!$I$33*Berechnung!$J$30+Berechnung!$K$33*Berechnung!$L$30+Berechnung!$M$33*Berechnung!$N$30)*E27*$H$2+0.001","v":1E-3},1.2805927740059999E-2,null,5.2914421710240003,1.2805927740059999E-2]
[null,{"$f":"(Berechnung!$A$33*Berechnung!$B$30+Berechnung!$C$33*Berechnung!$D$30+Berechnung!$E$33*Berechnung!$F$30+Berechnung!$G$33*Berechnung!$H$30+Berechnung!$I$33*Berechnung!$J$30+Berechnung!$K$33*Berechnung!$L$30+Berechnung!$M$33*Berechnung!$N$30)*E28*$H$2+0.001","v":1E-3},1.6525099569790001E-2,null,4.9792415388529996,1.6525099569790001E-2]
[null,{"$f":"(Berechnung!$A$33*Berechnung!$B$30+Berechnung!$C$33*Berechnung!$D$30+Berechnung!$E$33*Berechnung!$F$30+Berechnung!$G$33*Berechnung!$H$30+Berechnung!$I$33*Berechnung!$J$30+Berechnung!$K$33*Berechnung!$L$30+Berechnung!$M$33*Berechnung!$N$30)*E29*$H$2+0.001","v":1E-3},1.886797380948E-2,null,4.8909887169040003,1.886797380948E-2]
[null,{"$f":"(Berechnung!$A$33*Berechnung!$B$30+Berechnung!$C$33*Berechnung!$D$30+Berechnung!$E$33*Berechnung!$F$30+Berechnung!$G$33*Berechnung!$H$30+Berechnung!$I$33*Berechnung!$J$30+Berechnung!$K$33*Berechnung!$L$30+Berechnung!$M$33*Berechnung!$N$30)*E30*$H$2+0.001","v":1E-3},2.2844152108539999E-2,null,4.8330513894639999,2.2844152108539999E-2]
[null,{"$f":"(Berechnung!$A$33*Berechnung!$B$30+Berechnung!$C$33*Berechnung!$D$30+Berechnung!$E$33*Berechnung!$F$30+Berechnung!$G$33*Berechnung!$H$30+Berechnung!$I$33*Berechnung!$J$30+Berechnung!$K$33*Berechnung!$L$30+Berechnung!$M$33*Berechnung!$N$30)*E31*$H$2+0.001","v":1E-3},2.5686932280300001E-2,null,4.8100798065779999,2.5686932280300001E-2]
[null,{"$f":"(Berechnung!$A$33*Berechnung!$B$30+Berechnung!$C$33*Berechnung!$D$30+Berechnung!$E$33*Berechnung!$F$30+Berechnung!$G$33*Berechnung!$H$30+Berechnung!$I$33*Berechnung!$J$30+Berechnung!$K$33*Berechnung!$L$30+Berechnung!$M$33*Berechnung!$N$30)*E32*$H$2+0.001","v":1E-3},2.9168723716080001,null,4.8055889419510001,2.9168723716080001]
[null,{"$f":"(Berechnung!$A$33*Berechnung!$B$30+Berechnung!$C$33*Berechnung!$D$30+Berechnung!$E$33*Berechnung!$F$30+Berechnung!$G$33*Berechnung!$H$30+Berechnung!$I$33*Berechnung!$J$30+Berechnung!$K$33*Berechnung!$L$30+Berechnung!$M$33*Berechnung!$N$30)*E33*$H$2+0.001","v":1E-3},4.7469813947399997,null,4.6868453783620003,4.7469813947399997]
[null,{"$f":"(Berechnung!$A$33*Berechnung!$B$30+Berechnung!$C$33*Berechnung!$D$30+Berechnung!$E$33*Berechnung!$F$30+Berechnung!$G$33*Berechnung!$H$30+Berechnung!$I$33*Berechnung!$J$30+Berechnung!$K$33*Berechnung!$L$30+Berechnung!$M$33*Berechnung!$N$30)*E34*$H$2+0.001","v":1E-3},6.078950072444,null,4.5709760340340004,6.078950072444]
[null,{"$f":"(Berechnung!$A$33*Berechnung!$B$30+Berechnung!$C$33*Berechnung!$D$30+Berechnung!$E$33*Berechnung!$F$30+Berechnung!$G$33*Berechnung!$H$30+Berechnung!$I$33*Berechnung!$J$30+Berechnung!$K$33*Berechnung!$L$30+Berechnung!$M$33*Berechnung!$N$30)*E35*$H$2+0.001","v":1E-3},7.0119543132429998,null,4.4846099333970004,7.0119543132429998]
[null,{"$f":"(Berechnung!$A$33*Berechnung!$B$30+Berechnung!$C$33*Berechnung!$D$30+Berechnung!$E$33*Berechnung!$F$30+Berechnung!$G$33*Berechnung!$H$30+Berechnung!$I$33*Berechnung!$J$30+Berechnung!$K$33*Berechnung!$L$30+Berechnung!$M$33*Berechnung!$N$30)*E36*$H$2+0.001","v":1E-3},7.8845384473470004,null,4.3841546331680004,7.8845384473470004]
[null,{"$f":"(Berechnung!$A$33*Berechnung!$B$30+Berechnung!$C$33*Berechnung!$D$30+Berechnung!$E$33*Berechnung!$F$30+Berechnung!$G$33*Berechnung!$H$30+Berechnung!$I$33*Berechnung!$J$30+Berechnung!$K$33*Berechnung!$L$30+Berechnung!$M$33*Berechnung!$N$30)*E37*$H$2+0.001","v":1E-3},12.476585403810001,null,3.7770212129159999,12.476585403810001]
[null,{"$f":"(Berechnung!$A$33*Berechnung!$B$30+Berechnung!$C$33*Berechnung!$D$30+Berechnung!$E$33*Berechnung!$F$30+Berechnung!$G$33*Berechnung!$H$30+Berechnung!$I$33*Berechnung!$J$30+Berechnung!$K$33*Berechnung!$L$30+Berechnung!$M$33*Berechnung!$N$30)*E38*$H$2+0.001","v":1E-3},59.097250503159998,null,2.5452790438520001,59.097250503159998]
[null,{"$f":"(Berechnung!$A$33*Berechnung!$B$30+Berechnung!$C$33*Berechnung!$D$30+Berechnung!$E$33*Berechnung!$F$30+Berechnung!$G$33*Berechnung!$H$30+Berechnung!$I$33*Berechnung!$J$30+Berechnung!$K$33*Berechnung!$L$30+Berechnung!$M$33*Berechnung!$N$30)*E39*$H$2+0.001","v":1E-3},194.39744986700001,null,1.9743957516490001,194.39744986700001]
[null,{"$f":"(Berechnung!$A$33*Berechnung!$B$30+Berechnung!$C$33*Berechnung!$D$30+Berechnung!$E$33*Berechnung!$F$30+Berechnung!$G$33*Berechnung!$H$30+Berechnung!$I$33*Berechnung!$J$30+Berechnung!$K$33*Berechnung!$L$30+Berechnung!$M$33*Berechnung!$N$30)*E40*$H$2+0.001","v":1E-3},1004.179447642,null,1.5008527589139999,1004.179447642]
[null,{"$f":"(Berechnung!$A$33*Berechnung!$B$30+Berechnung!$C$33*Berechnung!$D$30+Berechnung!$E$33*Berechnung!$F$30+Berechnung!$G$33*Berechnung!$H$30+Berechnung!$I$33*Berechnung!$J$30+Berechnung!$K$33*Berechnung!$L$30+Berechnung!$M$33*Berechnung!$N$30)*E41*$H$2+0.001","v":1E-3},2125.036824839,null,1.388952092781,2125.036824839]
[null,{"$f":"(Berechnung!$A$33*Berechnung!$B$30+Berechnung!$C$33*Berechnung!$D$30+Berechnung!$E$33*Berechnung!$F$30+Berechnung!$G$33*Berechnung!$H$30+Berechnung!$I$33*Berechnung!$J$30+Berechnung!$K$33*Berechnung!$L$30+Berechnung!$M$33*Berechnung!$N$30)*E42*$H$2+0.001","v":1E-3},4992.5467216099996,null,1.308605092583,4992.5467216099996]
[null,{"$f":"(Berechnung!$A$33*Berechnung!$B$30+Berechnung!$C$33*Berechnung!$D$30+Berechnung!$E$33*Berechnung!$F$30+Berechnung!$G$33*Berechnung!$H$30+Berechnung!$I$33*Berechnung!$J$30+Berechnung!$K$33*Berechnung!$L$30+Berechnung!$M$33*Berechnung!$N$30)*E43*$H$2+0.001","v":1E-3},9999,null,1.3024262825720001,9999]
[]
[null,{"$f":"(Berechnung!$A$33*Berechnung!$B$30+Berechnung!$C$33*Berechnung!$D$30+Berechnung!$E$33*Berechnung!$F$30+Berechnung!$G$33*Berechnung!$H$30+Berechnung!$I$33*Berechnung!$J$30+Berechnung!$K$33*Berechnung!$L$30+Berechnung!$M$33*Berechnung!$N$30)*E45*$H$45+0.001","v":1E-3},{"$f":"F45","v":9999},null,1.050792715207,9999,null,{"$f":"(Berechnung!G33+Berechnung!I33+Berechnung!K33+Berechnung!M33)","v":0}]
[null,{"$f":"(Berechnung!$A$33*Berechnung!$B$30+Berechnung!$C$33*Berechnung!$D$30+Berechnung!$E$33*Berechnung!$F$30+Berechnung!$G$33*Berechnung!$H$30+Berechnung!$I$33*Berechnung!$J$30+Berechnung!$K$33*Berechnung!$L$30+Berechnung!$M$33*Berechnung!$N$30)*E46*$H$45+0.001","v":1E-3},{"$f":"F46","v":3978.961472212},null,1.051993667219,3978.961472212]
[null,{"$f":"(Berechnung!$A$33*Berechnung!$B$30+Berechnung!$C$33*Berechnung!$D$30+Berechnung!$E$33*Berechnung!$F$30+Berechnung!$G$33*Berechnung!$H$30+Berechnung!$I$33*Berechnung!$J$30+Berechnung!$K$33*Berechnung!$L$30+Berechnung!$M$33*Berechnung!$N$30)*E47*$H$45+0.001","v":1E-3},1006.743093404,null,1.0902343659389999,1006.743093404]
[null,{"$f":"(Berechnung!$A$33*Berechnung!$B$30+Berechnung!$C$33*Berechnung!$D$30+Berechnung!$E$33*Berechnung!$F$30+Berechnung!$G$33*Berechnung!$H$30+Berechnung!$I$33*Berechnung!$J$30+Berechnung!$K$33*Berechnung!$L$30+Berechnung!$M$33*Berechnung!$N$30)*E48*$H$45+0.001","v":1E-3},299.10894277739999,null,1.143431648637,299.10894277739999]
[null,{"$f":"(Berechnung!$A$33*Berechnung!$B$30+Berechnung!$C$33*Berechnung!$D$30+Berechnung!$E$33*Berechnung!$F$30+Berechnung!$G$33*Berechnung!$H$30+Berechnung!$I$33*Berechnung!$J$30+Berechnung!$K$33*Berechnung!$L$30+Berechnung!$M$33*Berechnung!$N$30)*E49*$H$45+0.001","v":1E-3},146.479514303,null,1.2049924491690001,146.479514303]
[null,{"$f":"(Berechnung!$A$33*Berechnung!$B$30+Berechnung!$C$33*Berechnung!$D$30+Berechnung!$E$33*Berechnung!$F$30+Berechnung!$G$33*Berechnung!$H$30+Berechnung!$I$33*Berechnung!$J$30+Berechnung!$K$33*Berechnung!$L$30+Berechnung!$M$33*Berechnung!$N$30)*E50*$H$45+0.001","v":1E-3},70.825187484259999,null,1.298971834022,70.825187484259999]
[null,{"$f":"(Berechnung!$A$33*Berechnung!$B$30+Berechnung!$C$33*Berechnung!$D$30+Berechnung!$E$33*Berechnung!$F$30+Berechnung!$G$33*Berechnung!$H$30+Berechnung!$I$33*Berechnung!$J$30+Berechnung!$K$33*Berechnung!$L$30+Berechnung!$M$33*Berechnung!$N$30)*E51*$H$45+0.001","v":1E-3},42.641157692599997,null,1.3886554299089999,42.641157692599997]
[null,{"$f":"(Berechnung!$A$33*Berechnung!$B$30+Berechnung!$C$33*Berechnung!$D$30+Berechnung!$E$33*Berechnung!$F$30+Berechnung!$G$33*Berechnung!$H$30+Berechnung!$I$33*Berechnung!$J$30+Berechnung!$K$33*Berechnung!$L$30+Berechnung!$M$33*Berechnung!$N$30)*E52*$H$45+0.001","v":1E-3},27.015738820119999,null,1.504139909739,27.015738820119999]
[null,{"$f":"(Berechnung!$A$33*Berechnung!$B$30+Berechnung!$C$33*Berechnung!$D$30+Berechnung!$E$33*Berechnung!$F$30+Berechnung!$G$33*Berechnung!$H$30+Berechnung!$I$33*Berechnung!$J$30+Berechnung!$K$33*Berechnung!$L$30+Berechnung!$M$33*Berechnung!$N$30)*E53*$H$45+0.001","v":1E-3},10.01994484664,null,1.8686880585729999,10.01994484664]
[null,{"$f":"(Berechnung!$A$33*Berechnung!$B$30+Berechnung!$C$33*Berechnung!$D$30+Berechnung!$E$33*Berechnung!$F$30+Berechnung!$G$33*Berechnung!$H$30+Berechnung!$I$33*Berechnung!$J$30+Berechnung!$K$33*Berechnung!$L$30+Berechnung!$M$33*Berechnung!$N$30)*E54*$H$45+0.001","v":1E-3},4.7712501906879998,null,2.2968334721070001,4.7712501906879998]
[null,{"$f":"(Berechnung!$A$33*Berechnung!$B$30+Berechnung!$C$33*Berechnung!$D$30+Berechnung!$E$33*Berechnung!$F$30+Berechnung!$G$33*Berechnung!$H$30+Berechnung!$I$33*Berechnung!$J$30+Berechnung!$K$33*Berechnung!$L$30+Berechnung!$M$33*Berechnung!$N$30)*E55*$H$45+0.001","v":1E-3},2.148017331703,null,2.9787216033089998,2.148017331703]
[null,{"$f":"(Berechnung!$A$33*Berechnung!$B$30+Berechnung!$C$33*Berechnung!$D$30+Berechnung!$E$33*Berechnung!$F$30+Berechnung!$G$33*Berechnung!$H$30+Berechnung!$I$33*Berechnung!$J$30+Berechnung!$K$33*Berechnung!$L$30+Berechnung!$M$33*Berechnung!$N$30)*E56*$H$45+0.001","v":1E-3},0.76483715463190005,null,4.2446811091059997,0.76483715463190005]
[null,{"$f":"(Berechnung!$A$33*Berechnung!$B$30+Berechnung!$C$33*Berechnung!$D$30+Berechnung!$E$33*Berechnung!$F$30+Berechnung!$G$33*Berechnung!$H$30+Berechnung!$I$33*Berechnung!$J$30+Berechnung!$K$33*Berechnung!$L$30+Berechnung!$M$33*Berechnung!$N$30)*E57*$H$45+0.001","v":1E-3},0.366993039676,null,5.5975591201909998,0.366993039676]
[null,{"$f":"(Berechnung!$A$33*Berechnung!$B$30+Berechnung!$C$33*Berechnung!$D$30+Berechnung!$E$33*Berechnung!$F$30+Berechnung!$G$33*Berechnung!$H$30+Berechnung!$I$33*Berechnung!$J$30+Berechnung!$K$33*Berechnung!$L$30+Berechnung!$M$33*Berechnung!$N$30)*E58*$H$45+0.001","v":1E-3},0.33566129383330001,null,5.8014416824149997,0.33566129383330001]
[null,{"$f":"(Berechnung!$A$33*Berechnung!$B$30+Berechnung!$C$33*Berechnung!$D$30+Berechnung!$E$33*Berechnung!$F$30+Berechnung!$G$33*Berechnung!$H$30+Berechnung!$I$33*Berechnung!$J$30+Berechnung!$K$33*Berechnung!$L$30+Berechnung!$M$33*Berechnung!$N$30)*E59*$H$45+0.001","v":1E-3},0.30936180434839999,null,5.9556549047490002,0.30936180434839999]
[null,{"$f":"(Berechnung!$A$33*Berechnung!$B$30+Berechnung!$C$33*Berechnung!$D$30+Berechnung!$E$33*Berechnung!$F$30+Berechnung!$G$33*Berechnung!$H$30+Berechnung!$I$33*Berechnung!$J$30+Berechnung!$K$33*Berechnung!$L$30+Berechnung!$M$33*Berechnung!$N$30)*E60*$H$45+0.001","v":1E-3},0.27936595324419999,null,6.0776087912410004,0.27936595324419999]
[null,{"$f":"(Berechnung!$A$33*Berechnung!$B$30+Berechnung!$C$33*Berechnung!$D$30+Berechnung!$E$33*Berechnung!$F$30+Berechnung!$G$33*Berechnung!$H$30+Berechnung!$I$33*Berechnung!$J$30+Berechnung!$K$33*Berechnung!$L$30+Berechnung!$M$33*Berechnung!$N$30)*E61*$H$45+0.001","v":1E-3},0.2522785125218,null,6.172541856114,0.2522785125218]
[null,{"$f":"(Berechnung!$A$33*Berechnung!$B$30+Berechnung!$C$33*Berechnung!$D$30+Berechnung!$E$33*Berechnung!$F$30+Berechnung!$G$33*Berechnung!$H$30+Berechnung!$I$33*Berechnung!$J$30+Berechnung!$K$33*Berechnung!$L$30+Berechnung!$M$33*Berechnung!$N$30)*E62*$H$45+0.001","v":1E-3},0.21815362300560001,null,6.2764243040550003,0.21815362300560001]
[null,{"$f":"(Berechnung!$A$33*Berechnung!$B$30+Berechnung!$C$33*Berechnung!$D$30+Berechnung!$E$33*Berechnung!$F$30+Berechnung!$G$33*Berechnung!$H$30+Berechnung!$I$33*Berechnung!$J$30+Berechnung!$K$33*Berechnung!$L$30+Berechnung!$M$33*Berechnung!$N$30)*E63*$H$45+0.001","v":1E-3},0.1473104483687,null,6.3972104007599997,0.1473104483687]
[null,{"$f":"(Berechnung!$A$33*Berechnung!$B$30+Berechnung!$C$33*Berechnung!$D$30+Berechnung!$E$33*Berechnung!$F$30+Berechnung!$G$33*Berechnung!$H$30+Berechnung!$I$33*Berechnung!$J$30+Berechnung!$K$33*Berechnung!$L$30+Berechnung!$M$33*Berechnung!$N$30)*E64*$H$45+0.001","v":1E-3},2.7728868755149998E-2,null,6.4119031601829999,2.7728868755149998E-2]
[null,{"$f":"(Berechnung!$A$33*Berechnung!$B$30+Berechnung!$C$33*Berechnung!$D$30+Berechnung!$E$33*Berechnung!$F$30+Berechnung!$G$33*Berechnung!$H$30+Berechnung!$I$33*Berechnung!$J$30+Berechnung!$K$33*Berechnung!$L$30+Berechnung!$M$33*Berechnung!$N$30)*E65*$H$45+0.001","v":1E-3},2.2612351186009998E-2,null,6.4578802163580002,2.2612351186009998E-2]
[null,{"$f":"(Berechnung!$A$33*Berechnung!$B$30+Berechnung!$C$33*Berechnung!$D$30+Berechnung!$E$33*Berechnung!$F$30+Berechnung!$G$33*Berechnung!$H$30+Berechnung!$I$33*Berechnung!$J$30+Berechnung!$K$33*Berechnung!$L$30+Berechnung!$M$33*Berechnung!$N$30)*E66*$H$45+0.001","v":1E-3},1.877200252564E-2,null,6.5665502028349998,1.877200252564E-2]
[null,{"$f":"(Berechnung!$A$33*Berechnung!$B$30+Berechnung!$C$33*Berechnung!$D$30+Berechnung!$E$33*Berechnung!$F$30+Berechnung!$G$33*Berechnung!$H$30+Berechnung!$I$33*Berechnung!$J$30+Berechnung!$K$33*Berechnung!$L$30+Berechnung!$M$33*Berechnung!$N$30)*E67*$H$45+0.001","v":1E-3},1.550460924627E-2,null,6.749105849307,1.550460924627E-2]
[null,{"$f":"(Berechnung!$A$33*Berechnung!$B$30+Berechnung!$C$33*Berechnung!$D$30+Berechnung!$E$33*Berechnung!$F$30+Berechnung!$G$33*Berechnung!$H$30+Berechnung!$I$33*Berechnung!$J$30+Berechnung!$K$33*Berechnung!$L$30+Berechnung!$M$33*Berechnung!$N$30)*E68*$H$45+0.001","v":1E-3},1.368363990215E-2,null,6.9782524489749997,1.368363990215E-2]
[null,{"$f":"(Berechnung!$A$33*Berechnung!$B$30+Berechnung!$C$33*Berechnung!$D$30+Berechnung!$E$33*Berechnung!$F$30+Berechnung!$G$33*Berechnung!$H$30+Berechnung!$I$33*Berechnung!$J$30+Berechnung!$K$33*Berechnung!$L$30+Berechnung!$M$33*Berechnung!$N$30)*E69*$H$45+0.001","v":1E-3},1.1984514826200001E-2,null,7.3191841864649998,1.1984514826200001E-2]
[null,{"$f":"(Berechnung!$A$33*Berechnung!$B$30+Berechnung!$C$33*Berechnung!$D$30+Berechnung!$E$33*Berechnung!$F$30+Berechnung!$G$33*Berechnung!$H$30+Berechnung!$I$33*Berechnung!$J$30+Berechnung!$K$33*Berechnung!$L$30+Berechnung!$M$33*Berechnung!$N$30)*E70*$H$45+0.001","v":1E-3},1.0603972645839999E-2,null,7.7319099951250001,1.0603972645839999E-2]
[null,{"$f":"(Berechnung!$A$33*Berechnung!$B$30+Berechnung!$C$33*Berechnung!$D$30+Berechnung!$E$33*Berechnung!$F$30+Berechnung!$G$33*Berechnung!$H$30+Berechnung!$I$33*Berechnung!$J$30+Berechnung!$K$33*Berechnung!$L$30+Berechnung!$M$33*Berechnung!$N$30)*E71*$H$45+0.001","v":1E-3},1.002552975734E-2,null,8.0903749144529993,1.002552975734E-2]
[null,{"$f":"(Berechnung!$A$33*Berechnung!$B$30+Berechnung!$C$33*Berechnung!$D$30+Berechnung!$E$33*Berechnung!$F$30+Berechnung!$G$33*Berechnung!$H$30+Berechnung!$I$33*Berechnung!$J$30+Berechnung!$K$33*Berechnung!$L$30+Berechnung!$M$33*Berechnung!$N$30)*E72*$H$45+0.001","v":1E-3},0.01,null,12.208750675859999,0.01]
[null,{"$f":"(Berechnung!$A$33*Berechnung!$B$30+Berechnung!$C$33*Berechnung!$D$30+Berechnung!$E$33*Berechnung!$F$30+Berechnung!$G$33*Berechnung!$H$30+Berechnung!$I$33*Berechnung!$J$30+Berechnung!$K$33*Berechnung!$L$30+Berechnung!$M$33*Berechnung!$N$30)*E73*$H$45+0.001","v":1E-3},1.1505438383299999E-2,null,11.08455548547,1.1505438383299999E-2]
[null,{"$f":"(Berechnung!$A$33*Berechnung!$B$30+Berechnung!$C$33*Berechnung!$D$30+Berechnung!$E$33*Berechnung!$F$30+Berechnung!$G$33*Berechnung!$H$30+Berechnung!$I$33*Berechnung!$J$30+Berechnung!$K$33*Berechnung!$L$30+Berechnung!$M$33*Berechnung!$N$30)*E74*$H$45+0.001","v":1E-3},1.290425801646E-2,null,10.593459626710001,1.290425801646E-2]
[null,{"$f":"(Berechnung!$A$33*Berechnung!$B$30+Berechnung!$C$33*Berechnung!$D$30+Berechnung!$E$33*Berechnung!$F$30+Berechnung!$G$33*Berechnung!$H$30+Berechnung!$I$33*Berechnung!$J$30+Berechnung!$K$33*Berechnung!$L$30+Berechnung!$M$33*Berechnung!$N$30)*E75*$H$45+0.001","v":1E-3},1.6865636193960001E-2,null,9.9803377072190003,1.6865636193960001E-2]
[null,{"$f":"(Berechnung!$A$33*Berechnung!$B$30+Berechnung!$C$33*Berechnung!$D$30+Berechnung!$E$33*Berechnung!$F$30+Berechnung!$G$33*Berechnung!$H$30+Berechnung!$I$33*Berechnung!$J$30+Berechnung!$K$33*Berechnung!$L$30+Berechnung!$M$33*Berechnung!$N$30)*E76*$H$45+0.001","v":1E-3},2.4223876407649999E-2,null,9.6527359788320002,2.4223876407649999E-2]
[null,{"$f":"(Berechnung!$A$33*Berechnung!$B$30+Berechnung!$C$33*Berechnung!$D$30+Berechnung!$E$33*Berechnung!$F$30+Berechnung!$G$33*Berechnung!$H$30+Berechnung!$I$33*Berechnung!$J$30+Berechnung!$K$33*Berechnung!$L$30+Berechnung!$M$33*Berechnung!$N$30)*E77*$H$45+0.001","v":1E-3},3.9826584774149999E-2,null,9.5956043955929999,3.9826584774149999E-2]
[null,{"$f":"(Berechnung!$A$33*Berechnung!$B$30+Berechnung!$C$33*Berechnung!$D$30+Berechnung!$E$33*Berechnung!$F$30+Berechnung!$G$33*Berechnung!$H$30+Berechnung!$I$33*Berechnung!$J$30+Berechnung!$K$33*Berechnung!$L$30+Berechnung!$M$33*Berechnung!$N$30)*E78*$H$45+0.001","v":1E-3},0.49835345469710002,null,9.6083825082890009,0.49835345469710002]
[null,{"$f":"(Berechnung!$A$33*Berechnung!$B$30+Berechnung!$C$33*Berechnung!$D$30+Berechnung!$E$33*Berechnung!$F$30+Berechnung!$G$33*Berechnung!$H$30+Berechnung!$I$33*Berechnung!$J$30+Berechnung!$K$33*Berechnung!$L$30+Berechnung!$M$33*Berechnung!$N$30)*E79*$H$45+0.001","v":1E-3},0.60030587130900004,null,9.5513510686279997,0.60030587130900004]
[null,{"$f":"(Berechnung!$A$33*Berechnung!$B$30+Berechnung!$C$33*Berechnung!$D$30+Berechnung!$E$33*Berechnung!$F$30+Berechnung!$G$33*Berechnung!$H$30+Berechnung!$I$33*Berechnung!$J$30+Berechnung!$K$33*Berechnung!$L$30+Berechnung!$M$33*Berechnung!$N$30)*E80*$H$45+0.001","v":1E-3},0.80485117934200001,null,9.3821438542319999,0.80485117934200001]
[null,{"$f":"(Berechnung!$A$33*Berechnung!$B$30+Berechnung!$C$33*Berechnung!$D$30+Berechnung!$E$33*Berechnung!$F$30+Berechnung!$G$33*Berechnung!$H$30+Berechnung!$I$33*Berechnung!$J$30+Berechnung!$K$33*Berechnung!$L$30+Berechnung!$M$33*Berechnung!$N$30)*E81*$H$45+0.001","v":1E-3},1.0098758545090001,null,9.1720387087390005,1.0098758545090001]
[null,{"$f":"(Berechnung!$A$33*Berechnung!$B$30+Berechnung!$C$33*Berechnung!$D$30+Berechnung!$E$33*Berechnung!$F$30+Berechnung!$G$33*Berechnung!$H$30+Berechnung!$I$33*Berechnung!$J$30+Berechnung!$K$33*Berechnung!$L$30+Berechnung!$M$33*Berechnung!$N$30)*E82*$H$45+0.001","v":1E-3},1.1471877679989999,null,8.9772907038989995,1.1471877679989999]
[null,{"$f":"(Berechnung!$A$33*Berechnung!$B$30+Berechnung!$C$33*Berechnung!$D$30+Berechnung!$E$33*Berechnung!$F$30+Berechnung!$G$33*Berechnung!$H$30+Berechnung!$I$33*Berechnung!$J$30+Berechnung!$K$33*Berechnung!$L$30+Berechnung!$M$33*Berechnung!$N$30)*E83*$H$45+0.001","v":1E-3},1.306496820145,null,8.7240247145679994,1.306496820145]
[null,{"$f":"(Berechnung!$A$33*Berechnung!$B$30+Berechnung!$C$33*Berechnung!$D$30+Berechnung!$E$33*Berechnung!$F$30+Berechnung!$G$33*Berechnung!$H$30+Berechnung!$I$33*Berechnung!$J$30+Berechnung!$K$33*Berechnung!$L$30+Berechnung!$M$33*Berechnung!$N$30)*E84*$H$45+0.001","v":1E-3},1.5031818662159999,null,8.3773939954699994,1.5031818662159999]
[null,{"$f":"(Berechnung!$A$33*Berechnung!$B$30+Berechnung!$C$33*Berechnung!$D$30+Berechnung!$E$33*Berechnung!$F$30+Berechnung!$G$33*Berechnung!$H$30+Berechnung!$I$33*Berechnung!$J$30+Berechnung!$K$33*Berechnung!$L$30+Berechnung!$M$33*Berechnung!$N$30)*E85*$H$45+0.001","v":1E-3},1.6988826700899999,null,7.9586382253760002,1.6988826700899999]
[null,{"$f":"(Berechnung!$A$33*Berechnung!$B$30+Berechnung!$C$33*Berechnung!$D$30+Berechnung!$E$33*Berechnung!$F$30+Berechnung!$G$33*Berechnung!$H$30+Berechnung!$I$33*Berechnung!$J$30+Berechnung!$K$33*Berechnung!$L$30+Berechnung!$M$33*Berechnung!$N$30)*E86*$H$45+0.001","v":1E-3},12.60448382459,null,3.7680244198259998,12.60448382459]
[null,{"$f":"(Berechnung!$A$33*Berechnung!$B$30+Berechnung!$C$33*Berechnung!$D$30+Berechnung!$E$33*Berechnung!$F$30+Berechnung!$G$33*Berechnung!$H$30+Berechnung!$I$33*Berechnung!$J$30+Berechnung!$K$33*Berechnung!$L$30+Berechnung!$M$33*Berechnung!$N$30)*E87*$H$45+0.001","v":1E-3},20.04745256312,null,3.3285489019610002,20.04745256312]
[null,{"$f":"(Berechnung!$A$33*Berechnung!$B$30+Berechnung!$C$33*Berechnung!$D$30+Berechnung!$E$33*Berechnung!$F$30+Berechnung!$G$33*Berechnung!$H$30+Berechnung!$I$33*Berechnung!$J$30+Berechnung!$K$33*Berechnung!$L$30+Berechnung!$M$33*Berechnung!$N$30)*E88*$H$45+0.001","v":1E-3},59.5510285577,null,2.5422461874820002,59.5510285577]
[null,{"$f":"(Berechnung!$A$33*Berechnung!$B$30+Berechnung!$C$33*Berechnung!$D$30+Berechnung!$E$33*Berechnung!$F$30+Berechnung!$G$33*Berechnung!$H$30+Berechnung!$I$33*Berechnung!$J$30+Berechnung!$K$33*Berechnung!$L$30+Berechnung!$M$33*Berechnung!$N$30)*E89*$H$45+0.001","v":1E-3},197.89821462419999,null,1.9696936016919999,197.89821462419999]
[null,{"$f":"(Berechnung!$A$33*Berechnung!$B$30+Berechnung!$C$33*Berechnung!$D$30+Berechnung!$E$33*Berechnung!$F$30+Berechnung!$G$33*Berechnung!$H$30+Berechnung!$I$33*Berechnung!$J$30+Berechnung!$K$33*Berechnung!$L$30+Berechnung!$M$33*Berechnung!$N$30)*E90*$H$45+0.001","v":1E-3},1006.743093404,null,1.5008529680439999,1006.743093404]
[null,{"$f":"(Berechnung!$A$33*Berechnung!$B$30+Berechnung!$C$33*Berechnung!$D$30+Berechnung!$E$33*Berechnung!$F$30+Berechnung!$G$33*Berechnung!$H$30+Berechnung!$I$33*Berechnung!$J$30+Berechnung!$K$33*Berechnung!$L$30+Berechnung!$M$33*Berechnung!$N$30)*E91*$H$45+0.001","v":1E-3},2196.6545043450001,null,1.385645372865,2196.6545043450001]
[null,{"$f":"(Berechnung!$A$33*Berechnung!$B$30+Berechnung!$C$33*Berechnung!$D$30+Berechnung!$E$33*Berechnung!$F$30+Berechnung!$G$33*Berechnung!$H$30+Berechnung!$I$33*Berechnung!$J$30+Berechnung!$K$33*Berechnung!$L$30+Berechnung!$M$33*Berechnung!$N$30)*E92*$H$45+0.001","v":1E-3},4992.5467216099996,null,1.308605092583,4992.5467216099996]
[null,{"$f":"(Berechnung!$A$33*Berechnung!$B$30+Berechnung!$C$33*Berechnung!$D$30+Berechnung!$E$33*Berechnung!$F$30+Berechnung!$G$33*Berechnung!$H$30+Berechnung!$I$33*Berechnung!$J$30+Berechnung!$K$33*Berechnung!$L$30+Berechnung!$M$33*Berechnung!$N$30)*E93*$H$45+0.001","v":1E-3},9999,null,1.3008739991,9999]

{"sheet":"Lasten","index":4,"n_rows":67,"n_cols":25,"rows_kept":67,"cut":false,"hidden":true,"merged":[[0,23,0,24],[1,23,1,24],[0,10,0,11],[1,10,1,11],[0,21,0,22],[1,21,1,22],[0,13,0,14],[0,15,0,16],[0,17,0,18],[0,19,0,20],[1,13,1,14],[1,15,1,16],[1,17,1,18],[1,19,1,20],[0,8,0,9],[0,0,0,1],[0,2,0,3],[0,4,0,5],[0,6,0,7]]}
[]
[null,null,null,null,null,null,null,null,null,null,null,null,null,false,null,false,null,false,null,false,null,false,null,false]
[]
[1E-3,0.21422644951178399,1E-3,9.2175187715685105,1E-3,1.1850454814853399,1E-3,18.464706725758202,1E-3,0.98035122038058897,1E-3,73.734027453058701,null,{"$f":"A4","v":1E-3},{"$f":"N$2*Übersicht!X$24*B4/0.175+0.001","v":1E-3},{"$f":"C4","v":1E-3},{"$f":"P$2*Übersicht!X$25*D4/1.15+0.001","v":1E-3},{"$f":"E4","v":1E-3},{"$f":"R$2*Übersicht!X$26*F4/0.271+0.001","v":1E-3},{"$f":"G4","v":1E-3},{"$f":"T$2*Übersicht!X$27*H4/0.9+0.001","v":1E-3},{"$f":"I4","v":1E-3},{"$f":"V$2*Übersicht!X$28*J4/0.65+0.001","v":1E-3},{"$f":"K4","v":1E-3},{"$f":"X$2*Übersicht!X$29*L4/1+0.001","v":1E-3}]
[2E-3,0.28409396210923699,2E-3,17.8069234684883,2E-3,2.1271775227413001,2E-3,13.8085872315741,2E-3,1.7211445576580899,2E-3,77.844716800211103,null,{"$f":"A5","v":2E-3},{"$f":"N$2*Übersicht!X$24*B5/0.175+0.001","v":1E-3},{"$f":"C5","v":2E-3},{"$f":"P$2*Übersicht!X$25*D5/1.15+0.001","v":1E-3},{"$f":"E5","v":2E-3},{"$f":"R$2*Übersicht!X$26*F5/0.271+0.001","v":1E-3},{"$f":"G5","v":2E-3},{"$f":"T$2*Übersicht!X$27*H5/0.9+0.001","v":1E-3},{"$f":"I5","v":2E-3},{"$f":"V$2*Übersicht!X$28*J5/0.65+0.001","v":1E-3},{"$f":"K5","v":2E-3},{"$f":"X$2*Übersicht!X$29*L5/1+0.001","v":1E-3}]
[3.0000000000000001E-3,0.29010229831395701,3.0000000000000001E-3,19.7446462044561,3.0000000000000001E-3,2.9070394980868199,3.0000000000000001E-3,11.250401555001201,3.0000000000000001E-3,2.3045397105346099,3.0000000000000001E-3,77.308581796592904,null,3.0000000000000001E-3,{"$f":"N$2*Übersicht!X$24*B6/0.175+0.001","v":1E-3},3.0000000000000001E-3,{"$f":"P$2*Übersicht!X$25*D6/1.15+0.001","v":1E-3},3.0000000000000001E-3,{"$f":"R$2*Übersicht!X$26*F6/0.271+0.001","v":1E-3},3.0000000000000001E-3,{"$f":"T$2*Übersicht!X$27*H6/0.9+0.001","v":1E-3},3.0000000000000001E-3,{"$f":"V$2*Übersicht!X$28*J6/0.65+0.001","v":1E-3},3.0000000000000001E-3,{"$f":"X$2*Übersicht!X$29*L6/1+0.001","v":1E-3}]
[4.0000000000000001E-3,0.27140776716966802,4.0000000000000001E-3,19.3284253590062,4.0000000000000001E-3,3.1577530655962698,4.0000000000000001E-3,9.7643211758687407,4.0000000000000001E-3,2.6330228011987402,4.0000000000000001E-3,73.146775954789703,null,4.0000000000000001E-3,{"$f":"N$2*Übersicht!X$24*B7/0.175+0.001","v":1E-3},4.0000000000000001E-3,{"$f":"P$2*Übersicht!X$25*D7/1.15+0.001","v":1E-3},4.0000000000000001E-3,{"$f":"R$2*Übersicht!X$26*F7/0.271+0.001","v":1E-3},4.0000000000000001E-3,{"$f":"T$2*Übersicht!X$27*H7/0.9+0.001","v":1E-3},4.0000000000000001E-3,{"$f":"V$2*Übersicht!X$28*J7/0.65+0.001","v":1E-3},4.0000000000000001E-3,{"$f":"X$2*Übersicht!X$29*L7/1+0.001","v":1E-3}]
[5.0000000000000001E-3,0.242538450391659,5.0000000000000001E-3,17.902972547581999,5.0000000000000001E-3,3.07158473329322,5.0000000000000001E-3,8.7223381033454892,5.0000000000000001E-3,2.7409161101564301,5.0000000000000001E-3,65.894127978639702,null,5.0000000000000001E-3,{"$f":"N$2*Übersicht!X$24*B8/0.175+0.001","v":1E-3},5.0000000000000001E-3,{"$f":"P$2*Übersicht!X$25*D8/1.15+0.001","v":1E-3},5.0000000000000001E-3,{"$f":"R$2*Übersicht!X$26*F8/0.271+0.001","v":1E-3},5.0000000000000001E-3,{"$f":"T$2*Übersicht!X$27*H8/0.9+0.001","v":1E-3},5.0000000000000001E-3,{"$f":"V$2*Übersicht!X$28*J8/0.65+0.001","v":1E-3},5.0000000000000001E-3,{"$f":"X$2*Übersicht!X$29*L8/1+0.001","v":1E-3}]
[6.0000000000000001E-3,0.22550168368336701,6.0000000000000001E-3,16.4608902080451,6.0000000000000001E-3,2.8694899377540901,6.0000000000000001E-3,7.9727273807275001,6.0000000000000001E-3,2.6914852315301401,6.0000000000000001E-3,60.2578355813787,null,6.0000000000000001E-3,{"$f":"N$2*Übersicht!X$24*B9/0.175+0.001","v":1E-3},6.0000000000000001E-3,{"$f":"P$2*Übersicht!X$25*D9/1.15+0.001","v":1E-3},6.0000000000000001E-3,{"$f":"R$2*Übersicht!X$26*F9/0.271+0.001","v":1E-3},6.0000000000000001E-3,{"$f":"T$2*Übersicht!X$27*H9/0.9+0.001","v":1E-3},6.0000000000000001E-3,{"$f":"V$2*Übersicht!X$28*J9/0.65+0.001","v":1E-3},6.0000000000000001E-3,{"$f":"X$2*Übersicht!X$29*L9/1+0.001","v":1E-3}]
[7.0000000000000001E-3,0.21809508999174401,7.0000000000000001E-3,15.2607888965371,7.0000000000000001E-3,2.6673854784564002,7.0000000000000001E-3,7.3957454321195204,7.0000000000000001E-3,2.5525118900840802,7.0000000000000001E-3,55.8533662535853,null,7.0000000000000001E-3,{"$f":"N$2*Übersicht!X$24*B10/0.175+0.001","v":1E-3},7.0000000000000001E-3,{"$f":"P$2*Übersicht!X$25*D10/1.15+0.001","v":1E-3},7.0000000000000001E-3,{"$f":"R$2*Übersicht!X$26*F10/0.271+0.001","v":1E-3},7.0000000000000001E-3,{"$f":"T$2*Übersicht!X$27*H10/0.9+0.001","v":1E-3},7.0000000000000001E-3,{"$f":"V$2*Übersicht!X$28*J10/0.65+0.001","v":1E-3},7.0000000000000001E-3,{"$f":"X$2*Übersicht!X$29*L10/1+0.001","v":1E-3}]
[8.0000000000000002E-3,0.22278799584689299,8.0000000000000002E-3,14.262022365020799,8.0000000000000002E-3,2.4929631235874199,8.0000000000000002E-3,9.1355855685548093,8.0000000000000002E-3,2.3902766599766898,8.0000000000000002E-3,52.617940459798902,null,8.0000000000000002E-3,{"$f":"N$2*Übersicht!X$24*B11/0.175+0.001","v":1E-3},8.0000000000000002E-3,{"$f":"P$2*Übersicht!X$25*D11/1.15+0.001","v":1E-3},8.0000000000000002E-3,{"$f":"R$2*Übersicht!X$26*F11/0.271+0.001","v":1E-3},8.0000000000000002E-3,{"$f":"T$2*Übersicht!X$27*H11/0.9+0.001","v":1E-3},8.0000000000000002E-3,{"$f":"V$2*Übersicht!X$28*J11/0.65+0.001","v":1E-3},8.0000000000000002E-3,{"$f":"X$2*Übersicht!X$29*L11/1+0.001","v":1E-3}]
[8.9999999999999993E-3,0.230557117967821,8.9999999999999993E-3,13.456163251255701,8.9999999999999993E-3,2.3520951338296698,8.9999999999999993E-3,8.6798635514925806,8.9999999999999993E-3,2.27782566950094,8.9999999999999993E-3,49.608688708045101,null,8.9999999999999993E-3,{"$f":"N$2*Übersicht!X$24*B12/0.175+0.001","v":1E-3},8.9999999999999993E-3,{"$f":"P$2*Übersicht!X$25*D12/1.15+0.001","v":1E-3},8.9999999999999993E-3,{"$f":"R$2*Übersicht!X$26*F12/0.271+0.001","v":1E-3},8.9999999999999993E-3,{"$f":"T$2*Übersicht!X$27*H12/0.9+0.001","v":1E-3},8.9999999999999993E-3,{"$f":"V$2*Übersicht!X$28*J12/0.65+0.001","v":1E-3},8.9999999999999993E-3,{"$f":"X$2*Übersicht!X$29*L12/1+0.001","v":1E-3}]
[0.01,0.238755310241589,0.01,12.7587032962285,0.01,2.23268552181155,0.01,8.2392053492231199,0.01,2.2592865265794901,0.01,46.829735198654298,null,0.01,{"$f":"N$2*Übersicht!X$24*B13/0.175+0.001","v":1E-3},0.01,{"$f":"P$2*Übersicht!X$25*D13/1.15+0.001","v":1E-3},0.01,{"$f":"R$2*Übersicht!X$26*F13/0.271+0.001","v":1E-3},0.01,{"$f":"T$2*Übersicht!X$27*H13/0.9+0.001","v":1E-3},0.01,{"$f":"V$2*Übersicht!X$28*J13/0.65+0.001","v":1E-3},0.01,{"$f":"X$2*Übersicht!X$29*L13/1+0.001","v":1E-3}]
[0.02,0.22804425469460701,0.02,9.7991366986607993,0.02,1.57895369490814,0.02,7.5411714842946296,0.02,2.4630315949933199,0.02,35.647669099925402,null,0.02,{"$f":"N$2*Übersicht!X$24*B14/0.175+0.001","v":1E-3},0.02,{"$f":"P$2*Übersicht!X$25*D14/1.15+0.001","v":1E-3},0.02,{"$f":"R$2*Übersicht!X$26*F14/0.271+0.001","v":1E-3},0.02,{"$f":"T$2*Übersicht!X$27*H14/0.9+0.001","v":1E-3},0.02,{"$f":"V$2*Übersicht!X$28*J14/0.65+0.001","v":1E-3},0.02,{"$f":"X$2*Übersicht!X$29*L14/1+0.001","v":1E-3}]
[0.03,0.22253033228670199,0.03,8.0902668879074398,0.03,1.3343304896630499,0.03,7.3608321098475296,0.03,2.5511028354589098,0.03,30.677141079218401,null,0.03,{"$f":"N$2*Übersicht!X$24*B15/0.175+0.001","v":1E-3},0.03,{"$f":"P$2*Übersicht!X$25*D15/1.15+0.001","v":1E-3},0.03,{"$f":"R$2*Übersicht!X$26*F15/0.271+0.001","v":1E-3},0.03,{"$f":"T$2*Übersicht!X$27*H15/0.9+0.001","v":1E-3},0.03,{"$f":"V$2*Übersicht!X$28*J15/0.65+0.001","v":1E-3},0.03,{"$f":"X$2*Übersicht!X$29*L15/1+0.001","v":1E-3}]
[0.04,0.22069120293595801,0.04,7.0285080305435397,0.04,1.15577482929894,0.04,7.3607059323457298,0.04,2.5764228933137101,0.04,27.785563248075398,null,0.04,{"$f":"N$2*Übersicht!X$24*B16/0.175+0.001","v":1E-3},0.04,{"$f":"P$2*Übersicht!X$25*D16/1.15+0.001","v":1E-3},0.04,{"$f":"R$2*Übersicht!X$26*F16/0.271+0.001","v":1E-3},0.04,{"$f":"T$2*Übersicht!X$27*H16/0.9+0.001","v":1E-3},0.04,{"$f":"V$2*Übersicht!X$28*J16/0.65+0.001","v":1E-3},0.04,{"$f":"X$2*Übersicht!X$29*L16/1+0.001","v":1E-3}]
[0.05,0.219017870582117,0.05,6.29739579326393,0.05,1.04470042881827,0.05,6.9431295748088004,0.05,2.5982279595729301,0.05,24.836075026065799,null,0.05,{"$f":"N$2*Übersicht!X$24*B17/0.175+0.001","v":1E-3},0.05,{"$f":"P$2*Übersicht!X$25*D17/1.15+0.001","v":1E-3},0.05,{"$f":"R$2*Übersicht!X$26*F17/0.271+0.001","v":1E-3},0.05,{"$f":"T$2*Übersicht!X$27*H17/0.9+0.001","v":1E-3},0.05,{"$f":"V$2*Übersicht!X$28*J17/0.65+0.001","v":1E-3},0.05,{"$f":"X$2*Übersicht!X$29*L17/1+0.001","v":1E-3}]
[0.06,0.218187817780572,0.06,5.7554103446907501,0.06,0.95414766447121502,0.06,6.4078207844838397,0.06,2.6035566443363498,0.06,22.698029998541902,null,0.06,{"$f":"N$2*Übersicht!X$24*B18/0.175+0.001","v":1E-3},0.06,{"$f":"P$2*Übersicht!X$25*D18/1.15+0.001","v":1E-3},0.06,{"$f":"R$2*Übersicht!X$26*F18/0.271+0.001","v":1E-3},0.06,{"$f":"T$2*Übersicht!X$27*H18/0.9+0.001","v":1E-3},0.06,{"$f":"V$2*Übersicht!X$28*J18/0.65+0.001","v":1E-3},0.06,{"$f":"X$2*Übersicht!X$29*L18/1+0.001","v":1E-3}]
[7.0000000000000007E-2,0.217690157420143,7.0000000000000007E-2,5.3314407646483302,7.0000000000000007E-2,0.88790956607523996,7.0000000000000007E-2,5.9529563427631302,7.0000000000000007E-2,2.5913778383110002,7.0000000000000007E-2,21.001381662171699,null,7.0000000000000007E-2,{"$f":"N$2*Übersicht!X$24*B19/0.175+0.001","v":1E-3},7.0000000000000007E-2,{"$f":"P$2*Übersicht!X$25*D19/1.15+0.001","v":1E-3},7.0000000000000007E-2,{"$f":"R$2*Übersicht!X$26*F19/0.271+0.001","v":1E-3},7.0000000000000007E-2,{"$f":"T$2*Übersicht!X$27*H19/0.9+0.001","v":1E-3},7.0000000000000007E-2,{"$f":"V$2*Übersicht!X$28*J19/0.65+0.001","v":1E-3},7.0000000000000007E-2,{"$f":"X$2*Übersicht!X$29*L19/1+0.001","v":1E-3}]
[0.08,0.217102088296656,0.08,4.9889361138361101,0.08,0.83078473492361105,0.08,5.5881083768870097,0.08,2.5514225446037702,0.08,19.660272633019598,null,0.08,{"$f":"N$2*Übersicht!X$24*B20/0.175+0.001","v":1E-3},0.08,{"$f":"P$2*Übersicht!X$25*D20/1.15+0.001","v":1E-3},0.08,{"$f":"R$2*Übersicht!X$26*F20/0.271+0.001","v":1E-3},0.08,{"$f":"T$2*Übersicht!X$27*H20/0.9+0.001","v":1E-3},0.08,{"$f":"V$2*Übersicht!X$28*J20/0.65+0.001","v":1E-3},0.08,{"$f":"X$2*Übersicht!X$29*L20/1+0.001","v":1E-3}]
[0.09,0.21661574287069901,0.09,4.7049044267551796,0.09,0.78574996473566405,0.09,5.3274788673662696,0.09,2.47204311116043,0.09,18.536884361061102,null,0.09,{"$f":"N$2*Übersicht!X$24*B21/0.175+0.001","v":1E-3},0.09,{"$f":"P$2*Übersicht!X$25*D21/1.15+0.001","v":1E-3},0.09,{"$f":"R$2*Übersicht!X$26*F21/0.271+0.001","v":1E-3},0.09,{"$f":"T$2*Übersicht!X$27*H21/0.9+0.001","v":1E-3},0.09,{"$f":"V$2*Übersicht!X$28*J21/0.65+0.001","v":1E-3},0.09,{"$f":"X$2*Übersicht!X$29*L21/1+0.001","v":1E-3}]
[0.1,0.21643545964004299,0.1,4.46431347803754,0.1,0.74564604237550702,0.1,5.1639188379583398,0.1,2.38229294378253,0.1,17.586424556207,null,0.1,{"$f":"N$2*Übersicht!X$24*B22/0.175+0.001","v":1E-3},0.1,{"$f":"P$2*Übersicht!X$25*D22/1.15+0.001","v":1E-3},0.1,{"$f":"R$2*Übersicht!X$26*F22/0.271+0.001","v":1E-3},0.1,{"$f":"T$2*Übersicht!X$27*H22/0.9+0.001","v":1E-3},0.1,{"$f":"V$2*Übersicht!X$28*J22/0.65+0.001","v":1E-3},0.1,{"$f":"X$2*Übersicht!X$29*L22/1+0.001","v":1E-3}]
[0.2,0.212602616252386,0.2,3.1553236805578102,0.2,0.55890105684884395,0.2,4.8549820088076903,0.2,1.76322768090364,0.2,12.583954167045601,null,0.2,{"$f":"N$2*Übersicht!X$24*B23/0.175+0.001","v":1E-3},0.2,{"$f":"P$2*Übersicht!X$25*D23/1.15+0.001","v":1E-3},0.2,{"$f":"R$2*Übersicht!X$26*F23/0.271+0.001","v":1E-3},0.2,{"$f":"T$2*Übersicht!X$27*H23/0.9+0.001","v":1E-3},0.2,{"$f":"V$2*Übersicht!X$28*J23/0.65+0.001","v":1E-3},0.2,{"$f":"X$2*Übersicht!X$29*L23/1+0.001","v":1E-3}]
[0.3,0.21110121465183801,0.3,2.57164445915179,0.3,0.48010315650808899,0.3,4.1701930579114599,0.3,1.48302135078595,0.3,10.394365058632999,null,0.3,{"$f":"N$2*Übersicht!X$24*B24/0.175+0.001","v":1E-3},0.3,{"$f":"P$2*Übersicht!X$25*D24/1.15+0.001","v":1E-3},0.3,{"$f":"R$2*Übersicht!X$26*F24/0.271+0.001","v":1E-3},0.3,{"$f":"T$2*Übersicht!X$27*H24/0.9+0.001","v":1E-3},0.3,{"$f":"V$2*Übersicht!X$28*J24/0.65+0.001","v":1E-3},0.3,{"$f":"X$2*Übersicht!X$29*L24/1+0.001","v":1E-3}]
[0.4,0.21016118644415999,0.4,2.23261916523288,0.4,0.436685386093357,0.4,3.61943012744891,0.4,1.3250710298686199,0.4,9.3230097499829796,null,0.4,{"$f":"N$2*Übersicht!X$24*B25/0.175+0.001","v":1E-3},0.4,{"$f":"P$2*Übersicht!X$25*D25/1.15+0.001","v":1E-3},0.4,{"$f":"R$2*Übersicht!X$26*F25/0.271+0.001","v":1E-3},0.4,{"$f":"T$2*Übersicht!X$27*H25/0.9+0.001","v":1E-3},0.4,{"$f":"V$2*Übersicht!X$28*J25/0.65+0.001","v":1E-3},0.4,{"$f":"X$2*Übersicht!X$29*L25/1+0.001","v":1E-3}]
[0.5,0.20931768371821599,0.5,2.0001153424183302,0.5,0.408196357053213,0.5,3.24164409171089,0.5,1.2104794423046801,0.5,8.4337462579669893,null,0.5,{"$f":"N$2*Übersicht!X$24*B26/0.175+0.001","v":1E-3},0.5,{"$f":"P$2*Übersicht!X$25*D26/1.15+0.001","v":1E-3},0.5,{"$f":"R$2*Übersicht!X$26*F26/0.271+0.001","v":1E-3},0.5,{"$f":"T$2*Übersicht!X$27*H26/0.9+0.001","v":1E-3},0.5,{"$f":"V$2*Übersicht!X$28*J26/0.65+0.001","v":1E-3},0.5,{"$f":"X$2*Übersicht!X$29*L26/1+0.001","v":1E-3}]
[0.6,0.20884243933284899,0.6,1.82403377362285,0.6,0.38727204429849998,0.6,2.9554590249375101,0.6,1.10360652135517,0.6,7.7763216471474097,null,0.6,{"$f":"N$2*Übersicht!X$24*B27/0.175+0.001","v":1E-3},0.6,{"$f":"P$2*Übersicht!X$25*D27/1.15+0.001","v":1E-3},0.6,{"$f":"R$2*Übersicht!X$26*F27/0.271+0.001","v":1E-3},0.6,{"$f":"T$2*Übersicht!X$27*H27/0.9+0.001","v":1E-3},0.6,{"$f":"V$2*Übersicht!X$28*J27/0.65+0.001","v":1E-3},0.6,{"$f":"X$2*Übersicht!X$29*L27/1+0.001","v":1E-3}]
[0.7,0.208777107570051,0.7,1.6907966855565599,0.7,0.37219714912552299,0.7,2.73885189714141,0.7,1.0227165533762701,0.7,7.2219805994344197,null,0.7,{"$f":"N$2*Übersicht!X$24*B28/0.175+0.001","v":1E-3},0.7,{"$f":"P$2*Übersicht!X$25*D28/1.15+0.001","v":1E-3},0.7,{"$f":"R$2*Übersicht!X$26*F28/0.271+0.001","v":1E-3},0.7,{"$f":"T$2*Übersicht!X$27*H28/0.9+0.001","v":1E-3},0.7,{"$f":"V$2*Übersicht!X$28*J28/0.65+0.001","v":1E-3},0.7,{"$f":"X$2*Übersicht!X$29*L28/1+0.001","v":1E-3}]
[0.8,0.20823502372986399,0.8,1.5806132169667899,0.8,0.35985901992679398,0.8,2.5596821455654202,0.8,1.00225932463443,0.8,6.8287820558101302,null,0.8,{"$f":"N$2*Übersicht!X$24*B29/0.175+0.001","v":1E-3},0.8,{"$f":"P$2*Übersicht!X$25*D29/1.15+0.001","v":1E-3},0.8,{"$f":"R$2*Übersicht!X$26*F29/0.271+0.001","v":1E-3},0.8,{"$f":"T$2*Übersicht!X$27*H29/0.9+0.001","v":1E-3},0.8,{"$f":"V$2*Übersicht!X$28*J29/0.65+0.001","v":1E-3},0.8,{"$f":"X$2*Übersicht!X$29*L29/1+0.001","v":1E-3}]
[0.89999999999999902,0.20789487920573799,0.89999999999999902,1.4917309804496599,0.89999999999999902,0.35038002756751602,0.89999999999999902,2.4151300561846898,0.89999999999999902,1.0746966265494799,0.89999999999999902,6.5355670785442301,null,0.89999999999999902,{"$f":"N$2*Übersicht!X$24*B30/0.175+0.001","v":1E-3},0.89999999999999902,{"$f":"P$2*Übersicht!X$25*D30/1.15+0.001","v":1E-3},0.89999999999999902,{"$f":"R$2*Übersicht!X$26*F30/0.271+0.001","v":1E-3},0.89999999999999902,{"$f":"T$2*Übersicht!X$27*H30/0.9+0.001","v":1E-3},0.89999999999999902,{"$f":"V$2*Übersicht!X$28*J30/0.65+0.001","v":1E-3},0.89999999999999902,{"$f":"X$2*Übersicht!X$29*L30/1+0.001","v":1E-3}]
[1,0.207675082383765,1,1.4164264069871699,1,0.34256552808463298,1,2.29273831884711,1,1.03938502670558,1,6.2777964226140703,null,1,{"$f":"N$2*Übersicht!X$24*B31/0.175+0.001","v":1E-3},1,{"$f":"P$2*Übersicht!X$25*D31/1.15+0.001","v":1E-3},1,{"$f":"R$2*Übersicht!X$26*F31/0.271+0.001","v":1E-3},1,{"$f":"T$2*Übersicht!X$27*H31/0.9+0.001","v":1E-3},1,{"$f":"V$2*Übersicht!X$28*J31/0.65+0.001","v":1E-3},1,{"$f":"X$2*Übersicht!X$29*L31/1+0.001","v":1E-3}]
[2,0.20510743022571901,2,1.2503440419908001,2,0.30380447389237702,2,1.6219057680059901,2,0.86082826645982702,2,4.9757586676030501,null,2,{"$f":"N$2*Übersicht!X$24*B32/0.175+0.001","v":1E-3},2,{"$f":"P$2*Übersicht!X$25*D32/1.15+0.001","v":1E-3},2,{"$f":"R$2*Übersicht!X$26*F32/0.271+0.001","v":1E-3},2,{"$f":"T$2*Übersicht!X$27*H32/0.9+0.001","v":1E-3},2,{"$f":"V$2*Übersicht!X$28*J32/0.65+0.001","v":1E-3},2,{"$f":"X$2*Übersicht!X$29*L32/1+0.001","v":1E-3}]
[3,0.20279847728251599,3,1.2161085534765099,3,0.28937789039175299,3,1.326594690841,3,0.82029100543589195,3,4.5029734808482802,null,3,{"$f":"N$2*Übersicht!X$24*B33/0.175+0.001","v":1E-3},3,{"$f":"P$2*Übersicht!X$25*D33/1.15+0.001","v":1E-3},3,{"$f":"R$2*Übersicht!X$26*F33/0.271+0.001","v":1E-3},3,{"$f":"T$2*Übersicht!X$27*H33/0.9+0.001","v":1E-3},3,{"$f":"V$2*Übersicht!X$28*J33/0.65+0.001","v":1E-3},3,{"$f":"X$2*Übersicht!X$29*L33/1+0.001","v":1E-3}]
[4,0.199990430429697,4,1.1985739283636101,4,0.281682060933647,4,1.32583127020847,4,0.77794469150985801,4,4.2872067843670596,null,4,{"$f":"N$2*Übersicht!X$24*B34/0.175+0.001","v":1E-3},4,{"$f":"P$2*Übersicht!X$25*D34/1.15+0.001","v":1E-3},4,{"$f":"R$2*Übersicht!X$26*F34/0.271+0.001","v":1E-3},4,{"$f":"T$2*Übersicht!X$27*H34/0.9+0.001","v":1E-3},4,{"$f":"V$2*Übersicht!X$28*J34/0.65+0.001","v":1E-3},4,{"$f":"X$2*Übersicht!X$29*L34/1+0.001","v":1E-3}]
[5,0.19764695097101601,5,1.18721629592428,5,0.27686343547305498,5,1.18689045823082,5,0.76441208735521504,5,4.1763901584020102,null,5,{"$f":"N$2*Übersicht!X$24*B35/0.175+0.001","v":1E-3},5,{"$f":"P$2*Übersicht!X$25*D35/1.15+0.001","v":1E-3},5,{"$f":"R$2*Übersicht!X$26*F35/0.271+0.001","v":1E-3},5,{"$f":"T$2*Übersicht!X$27*H35/0.9+0.001","v":1E-3},5,{"$f":"V$2*Übersicht!X$28*J35/0.65+0.001","v":1E-3},5,{"$f":"X$2*Übersicht!X$29*L35/1+0.001","v":1E-3}]
[6,0.196013517331659,6,1.1796290255848201,6,0.27355641382248602,6,1.08442538584207,6,0.74442149437733796,6,4.1156120625007704,null,6,{"$f":"N$2*Übersicht!X$24*B36/0.175+0.001","v":1E-3},6,{"$f":"P$2*Übersicht!X$25*D36/1.15+0.001","v":1E-3},6,{"$f":"R$2*Übersicht!X$26*F36/0.271+0.001","v":1E-3},6,{"$f":"T$2*Übersicht!X$27*H36/0.9+0.001","v":1E-3},6,{"$f":"V$2*Übersicht!X$28*J36/0.65+0.001","v":1E-3},6,{"$f":"X$2*Übersicht!X$29*L36/1+0.001","v":1E-3}]
[7,0.19471144209951599,7,1.17380992920216,7,0.27114141214662102,7,1.1255650982544601,7,0.74109341125449502,7,4.0812326214629904,null,7,{"$f":"N$2*Übersicht!X$24*B37/0.175+0.001","v":1E-3},7,{"$f":"P$2*Übersicht!X$25*D37/1.15+0.001","v":1E-3},7,{"$f":"R$2*Übersicht!X$26*F37/0.271+0.001","v":1E-3},7,{"$f":"T$2*Übersicht!X$27*H37/0.9+0.001","v":1E-3},7,{"$f":"V$2*Übersicht!X$28*J37/0.65+0.001","v":1E-3},7,{"$f":"X$2*Übersicht!X$29*L37/1+0.001","v":1E-3}]
[8,0.19371734496576401,8,1.1699799241290401,8,0.27100000000000002,8,1.053570714873,8,0.72883188958154499,8,4.0423820445505196,null,8,{"$f":"N$2*Übersicht!X$24*B38/0.175+0.001","v":1E-3},8,{"$f":"P$2*Übersicht!X$25*D38/1.15+0.001","v":1E-3},8,{"$f":"R$2*Übersicht!X$26*F38/0.271+0.001","v":1E-3},8,{"$f":"T$2*Übersicht!X$27*H38/0.9+0.001","v":1E-3},8,{"$f":"V$2*Übersicht!X$28*J38/0.65+0.001","v":1E-3},8,{"$f":"X$2*Übersicht!X$29*L38/1+0.001","v":1E-3}]
[9,0.192996109388889,9,1.1669986938200001,9,0.27100000000000002,9,0.993967126343134,9,0.72887561793247502,9,3.99164380324852,null,9,{"$f":"N$2*Übersicht!X$24*B39/0.175+0.001","v":1E-3},9,{"$f":"P$2*Übersicht!X$25*D39/1.15+0.001","v":1E-3},9,{"$f":"R$2*Übersicht!X$26*F39/0.271+0.001","v":1E-3},9,{"$f":"T$2*Übersicht!X$27*H39/0.9+0.001","v":1E-3},9,{"$f":"V$2*Übersicht!X$28*J39/0.65+0.001","v":1E-3},9,{"$f":"X$2*Übersicht!X$29*L39/1+0.001","v":1E-3}]
[10,0.19236034192971599,10,1.1499999999999999,10,0.27100000000000002,10,1.036419417921,10,0.71996786902544296,10,3.92691236313195,null,10,{"$f":"N$2*Übersicht!X$24*B40/0.175+0.001","v":1E-3},10,{"$f":"P$2*Übersicht!X$25*D40/1.15+0.001","v":1E-3},10,{"$f":"R$2*Übersicht!X$26*F40/0.271+0.001","v":1E-3},10,{"$f":"T$2*Übersicht!X$27*H40/0.9+0.001","v":1E-3},10,{"$f":"V$2*Übersicht!X$28*J40/0.65+0.001","v":1E-3},10,{"$f":"X$2*Übersicht!X$29*L40/1+0.001","v":1E-3}]
[20,0.18948750184989399,20,1.1499999999999999,20,0.27100000000000002,20,0.9,20,0.68073488157030404,20,2.9818024986135501,null,20,{"$f":"N$2*Übersicht!X$24*B41/0.175+0.001","v":1E-3},20,{"$f":"P$2*Übersicht!X$25*D41/1.15+0.001","v":1E-3},20,{"$f":"R$2*Übersicht!X$26*F41/0.271+0.001","v":1E-3},20,{"$f":"T$2*Übersicht!X$27*H41/0.9+0.001","v":1E-3},20,{"$f":"V$2*Übersicht!X$28*J41/0.65+0.001","v":1E-3},20,{"$f":"X$2*Übersicht!X$29*L41/1+0.001","v":1E-3}]
[30,0.18846043980128099,30,1.1499999999999999,30,0.27100000000000002,30,0.9,30,0.67166210648701596,30,2.5021518926366899,null,30,{"$f":"N$2*Übersicht!X$24*B42/0.175+0.001","v":1E-3},30,{"$f":"P$2*Übersicht!X$25*D42/1.15+0.001","v":1E-3},30,{"$f":"R$2*Übersicht!X$26*F42/0.271+0.001","v":1E-3},30,{"$f":"T$2*Übersicht!X$27*H42/0.9+0.001","v":1E-3},30,{"$f":"V$2*Übersicht!X$28*J42/0.65+0.001","v":1E-3},30,{"$f":"X$2*Übersicht!X$29*L42/1+0.001","v":1E-3}]
[40,0.18788971439920699,40,1.1499999999999999,40,0.27100000000000002,40,0.9,40,0.66631260604008602,40,2.2238644451425098,null,40,{"$f":"N$2*Übersicht!X$24*B43/0.175+0.001","v":1E-3},40,{"$f":"P$2*Übersicht!X$25*D43/1.15+0.001","v":1E-3},40,{"$f":"R$2*Übersicht!X$26*F43/0.271+0.001","v":1E-3},40,{"$f":"T$2*Übersicht!X$27*H43/0.9+0.001","v":1E-3},40,{"$f":"V$2*Übersicht!X$28*J43/0.65+0.001","v":1E-3},40,{"$f":"X$2*Übersicht!X$29*L43/1+0.001","v":1E-3}]
[50,0.18642213115146,50,1.1499999999999999,50,0.27100000000000002,50,0.9,50,0.663082190361304,50,2.0387394282485398,null,50,{"$f":"N$2*Übersicht!X$24*B44/0.175+0.001","v":1E-3},50,{"$f":"P$2*Übersicht!X$25*D44/1.15+0.001","v":1E-3},50,{"$f":"R$2*Übersicht!X$26*F44/0.271+0.001","v":1E-3},50,{"$f":"T$2*Übersicht!X$27*H44/0.9+0.001","v":1E-3},50,{"$f":"V$2*Übersicht!X$28*J44/0.65+0.001","v":1E-3},50,{"$f":"X$2*Übersicht!X$29*L44/1+0.001","v":1E-3}]
[60,0.18456753728435099,60,1.1499999999999999,60,0.27100000000000002,60,0.9,60,0.66091980802914896,60,1.90535614700052,null,60,{"$f":"N$2*Übersicht!X$24*B45/0.175+0.001","v":1E-3},60,{"$f":"P$2*Übersicht!X$25*D45/1.15+0.001","v":1E-3},60,{"$f":"R$2*Übersicht!X$26*F45/0.271+0.001","v":1E-3},60,{"$f":"T$2*Übersicht!X$27*H45/0.9+0.001","v":1E-3},60,{"$f":"V$2*Übersicht!X$28*J45/0.65+0.001","v":1E-3},60,{"$f":"X$2*Übersicht!X$29*L45/1+0.001","v":1E-3}]
[70,0.18311796971661601,70,1.1499999999999999,70,0.27100000000000002,70,0.9,70,0.65923984776660904,70,1.7952320373181601,null,70,{"$f":"N$2*Übersicht!X$24*B46/0.175+0.001","v":1E-3},70,{"$f":"P$2*Übersicht!X$25*D46/1.15+0.001","v":1E-3},70,{"$f":"R$2*Übersicht!X$26*F46/0.271+0.001","v":1E-3},70,{"$f":"T$2*Übersicht!X$27*H46/0.9+0.001","v":1E-3},70,{"$f":"V$2*Übersicht!X$28*J46/0.65+0.001","v":1E-3},70,{"$f":"X$2*Übersicht!X$29*L46/1+0.001","v":1E-3}]
[80,0.182222753421212,80,1.1499999999999999,80,0.27100000000000002,80,0.9,80,0.65820684019840203,80,1.7241770602767299,null,80,{"$f":"N$2*Übersicht!X$24*B47/0.175+0.001","v":1E-3},80,{"$f":"P$2*Übersicht!X$25*D47/1.15+0.001","v":1E-3},80,{"$f":"R$2*Übersicht!X$26*F47/0.271+0.001","v":1E-3},80,{"$f":"T$2*Übersicht!X$27*H47/0.9+0.001","v":1E-3},80,{"$f":"V$2*Übersicht!X$28*J47/0.65+0.001","v":1E-3},80,{"$f":"X$2*Übersicht!X$29*L47/1+0.001","v":1E-3}]
[90,0.181434424920245,90,1.1499999999999999,90,0.27100000000000002,90,0.9,90,0.65730002923337205,90,1.65939387466481,null,90,{"$f":"N$2*Übersicht!X$24*B48/0.175+0.001","v":1E-3},90,{"$f":"P$2*Übersicht!X$25*D48/1.15+0.001","v":1E-3},90,{"$f":"R$2*Übersicht!X$26*F48/0.271+0.001","v":1E-3},90,{"$f":"T$2*Übersicht!X$27*H48/0.9+0.001","v":1E-3},90,{"$f":"V$2*Übersicht!X$28*J48/0.65+0.001","v":1E-3},90,{"$f":"X$2*Übersicht!X$29*L48/1+0.001","v":1E-3}]
[100,0.18080128730605299,100,1.1499999999999999,100,0.27100000000000002,100,0.9,100,0.65657367871943495,100,1.6056865286062501,null,100,{"$f":"N$2*Übersicht!X$24*B49/0.175+0.001","v":1E-3},100,{"$f":"P$2*Übersicht!X$25*D49/1.15+0.001","v":1E-3},100,{"$f":"R$2*Übersicht!X$26*F49/0.271+0.001","v":1E-3},100,{"$f":"T$2*Übersicht!X$27*H49/0.9+0.001","v":1E-3},100,{"$f":"V$2*Übersicht!X$28*J49/0.65+0.001","v":1E-3},100,{"$f":"X$2*Übersicht!X$29*L49/1+0.001","v":1E-3}]
[200,0.177924289364221,200,1.1499999999999999,200,0.27100000000000002,200,0.9,200,0.65329510773737298,200,1.33757789084367,null,200,{"$f":"N$2*Übersicht!X$24*B50/0.175+0.001","v":1E-3},200,{"$f":"P$2*Übersicht!X$25*D50/1.15+0.001","v":1E-3},200,{"$f":"R$2*Übersicht!X$26*F50/0.271+0.001","v":1E-3},200,{"$f":"T$2*Übersicht!X$27*H50/0.9+0.001","v":1E-3},200,{"$f":"V$2*Übersicht!X$28*J50/0.65+0.001","v":1E-3},200,{"$f":"X$2*Übersicht!X$29*L50/1+0.001","v":1E-3}]
[300,0.176954895845924,300,1.1499999999999999,300,0.27100000000000002,300,0.9,300,0.65219858826055199,300,1.2353446520637601,null,300,{"$f":"N$2*Übersicht!X$24*B51/0.175+0.001","v":1E-3},300,{"$f":"P$2*Übersicht!X$25*D51/1.15+0.001","v":1E-3},300,{"$f":"R$2*Übersicht!X$26*F51/0.271+0.001","v":1E-3},300,{"$f":"T$2*Übersicht!X$27*H51/0.9+0.001","v":1E-3},300,{"$f":"V$2*Übersicht!X$28*J51/0.65+0.001","v":1E-3},300,{"$f":"X$2*Übersicht!X$29*L51/1+0.001","v":1E-3}]
[400,0.17646820215801301,400,1.1499999999999999,400,0.27100000000000002,400,0.9,400,0.651649636612185,400,1.18091375935624,null,400,{"$f":"N$2*Übersicht!X$24*B52/0.175+0.001","v":1E-3},400,{"$f":"P$2*Übersicht!X$25*D52/1.15+0.001","v":1E-3},400,{"$f":"R$2*Übersicht!X$26*F52/0.271+0.001","v":1E-3},400,{"$f":"T$2*Übersicht!X$27*H52/0.9+0.001","v":1E-3},400,{"$f":"V$2*Übersicht!X$28*J52/0.65+0.001","v":1E-3},400,{"$f":"X$2*Übersicht!X$29*L52/1+0.001","v":1E-3}]
[500,0.176175540579006,500,1.1499999999999999,500,0.27100000000000002,500,0.9,500,0.65132004354037398,500,1.14701606162665,null,500,{"$f":"N$2*Übersicht!X$24*B53/0.175+0.001","v":1E-3},500,{"$f":"P$2*Übersicht!X$25*D53/1.15+0.001","v":1E-3},500,{"$f":"R$2*Übersicht!X$26*F53/0.271+0.001","v":1E-3},500,{"$f":"T$2*Übersicht!X$27*H53/0.9+0.001","v":1E-3},500,{"$f":"V$2*Übersicht!X$28*J53/0.65+0.001","v":1E-3},500,{"$f":"X$2*Übersicht!X$29*L53/1+0.001","v":1E-3}]
[600,0.175980162467026,600,1.1499999999999999,600,0.27100000000000002,600,0.9,600,0.65110022213521601,600,1.1238497251373301,null,600,{"$f":"N$2*Übersicht!X$24*B54/0.175+0.001","v":1E-3},600,{"$f":"P$2*Übersicht!X$25*D54/1.15+0.001","v":1E-3},600,{"$f":"R$2*Übersicht!X$26*F54/0.271+0.001","v":1E-3},600,{"$f":"T$2*Übersicht!X$27*H54/0.9+0.001","v":1E-3},600,{"$f":"V$2*Übersicht!X$28*J54/0.65+0.001","v":1E-3},600,{"$f":"X$2*Übersicht!X$29*L54/1+0.001","v":1E-3}]
[700,0.17583927765996399,700,1.1499999999999999,700,0.27100000000000002,700,0.9,700,0.65094181691903996,700,1.1068602848498801,null,700,{"$f":"N$2*Übersicht!X$24*B55/0.175+0.001","v":1E-3},700,{"$f":"P$2*Übersicht!X$25*D55/1.15+0.001","v":1E-3},700,{"$f":"R$2*Übersicht!X$26*F55/0.271+0.001","v":1E-3},700,{"$f":"T$2*Übersicht!X$27*H55/0.9+0.001","v":1E-3},700,{"$f":"V$2*Übersicht!X$28*J55/0.65+0.001","v":1E-3},700,{"$f":"X$2*Übersicht!X$29*L55/1+0.001","v":1E-3}]
[800,0.175735634367195,800,1.1499999999999999,800,0.27100000000000002,800,0.9,800,0.65082534096975397,800,1.09420229094918,null,800,{"$f":"N$2*Übersicht!X$24*B56/0.175+0.001","v":1E-3},800,{"$f":"P$2*Übersicht!X$25*D56/1.15+0.001","v":1E-3},800,{"$f":"R$2*Übersicht!X$26*F56/0.271+0.001","v":1E-3},800,{"$f":"T$2*Übersicht!X$27*H56/0.9+0.001","v":1E-3},800,{"$f":"V$2*Übersicht!X$28*J56/0.65+0.001","v":1E-3},800,{"$f":"X$2*Übersicht!X$29*L56/1+0.001","v":1E-3}]
[900,0.17565404935444501,900,1.1499999999999999,900,0.27100000000000002,900,0.9,900,0.65073368811136401,900,1.08413966034248,null,900,{"$f":"N$2*Übersicht!X$24*B57/0.175+0.001","v":1E-3},900,{"$f":"P$2*Übersicht!X$25*D57/1.15+0.001","v":1E-3},900,{"$f":"R$2*Übersicht!X$26*F57/0.271+0.001","v":1E-3},900,{"$f":"T$2*Übersicht!X$27*H57/0.9+0.001","v":1E-3},900,{"$f":"V$2*Übersicht!X$28*J57/0.65+0.001","v":1E-3},900,{"$f":"X$2*Übersicht!X$29*L57/1+0.001","v":1E-3}]
[1000,0.17558875405091401,1000,1.1499999999999999,1000,0.27100000000000002,1000,0.9,1000,0.65066035652920795,1000,1.0760218040610301,null,1000,{"$f":"N$2*Übersicht!X$24*B58/0.175+0.001","v":1E-3},1000,{"$f":"P$2*Übersicht!X$25*D58/1.15+0.001","v":1E-3},1000,{"$f":"R$2*Übersicht!X$26*F58/0.271+0.001","v":1E-3},1000,{"$f":"T$2*Übersicht!X$27*H58/0.9+0.001","v":1E-3},1000,{"$f":"V$2*Übersicht!X$28*J58/0.65+0.001","v":1E-3},1000,{"$f":"X$2*Übersicht!X$29*L58/1+0.001","v":1E-3}]
[2000,0.1752946242033,2000,1.1499999999999999,2000,0.27100000000000002,2000,0.9,2000,0.65033026208178102,2000,1.03870662913422,null,2000,{"$f":"N$2*Übersicht!X$24*B59/0.175+0.001","v":1E-3},2000,{"$f":"P$2*Übersicht!X$25*D59/1.15+0.001","v":1E-3},2000,{"$f":"R$2*Übersicht!X$26*F59/0.271+0.001","v":1E-3},2000,{"$f":"T$2*Übersicht!X$27*H59/0.9+0.001","v":1E-3},2000,{"$f":"V$2*Übersicht!X$28*J59/0.65+0.001","v":1E-3},2000,{"$f":"X$2*Übersicht!X$29*L59/1+0.001","v":1E-3}]
[3000,0.175196471187019,3000,1.1499999999999999,3000,0.27100000000000002,3000,0.9,3000,0.65022019335983805,3000,1.02596668607623,null,3000,{"$f":"N$2*Übersicht!X$24*B60/0.175+0.001","v":1E-3},3000,{"$f":"P$2*Übersicht!X$25*D60/1.15+0.001","v":1E-3},3000,{"$f":"R$2*Übersicht!X$26*F60/0.271+0.001","v":1E-3},3000,{"$f":"T$2*Übersicht!X$27*H60/0.9+0.001","v":1E-3},3000,{"$f":"V$2*Übersicht!X$28*J60/0.65+0.001","v":1E-3},3000,{"$f":"X$2*Übersicht!X$29*L60/1+0.001","v":1E-3}]
[4000,0.17514737405193301,4000,1.1499999999999999,4000,0.27100000000000002,4000,0.9,4000,0.650165152011147,4000,1.01953701781921,null,4000,{"$f":"N$2*Übersicht!X$24*B61/0.175+0.001","v":1E-3},4000,{"$f":"P$2*Übersicht!X$25*D61/1.15+0.001","v":1E-3},4000,{"$f":"R$2*Übersicht!X$26*F61/0.271+0.001","v":1E-3},4000,{"$f":"T$2*Übersicht!X$27*H61/0.9+0.001","v":1E-3},4000,{"$f":"V$2*Übersicht!X$28*J61/0.65+0.001","v":1E-3},4000,{"$f":"X$2*Übersicht!X$29*L61/1+0.001","v":1E-3}]
[5000,0.17511790916359801,5000,1.1499999999999999,5000,0.27100000000000002,5000,0.9,5000,0.65013212496518202,5000,1.01565967950044,null,5000,{"$f":"N$2*Übersicht!X$24*B62/0.175+0.001","v":1E-3},5000,{"$f":"P$2*Übersicht!X$25*D62/1.15+0.001","v":1E-3},5000,{"$f":"R$2*Übersicht!X$26*F62/0.271+0.001","v":1E-3},5000,{"$f":"T$2*Übersicht!X$27*H62/0.9+0.001","v":1E-3},5000,{"$f":"V$2*Übersicht!X$28*J62/0.65+0.001","v":1E-3},5000,{"$f":"X$2*Übersicht!X$29*L62/1+0.001","v":1E-3}]
[6000,0.175098263150129,6000,1.1499999999999999,6000,0.27100000000000002,6000,0.9,6000,0.65011010600240204,6000,1.01306654296207,null,6000,{"$f":"N$2*Übersicht!X$24*B63/0.175+0.001","v":1E-3},6000,{"$f":"P$2*Übersicht!X$25*D63/1.15+0.001","v":1E-3},6000,{"$f":"R$2*Übersicht!X$26*F63/0.271+0.001","v":1E-3},6000,{"$f":"T$2*Übersicht!X$27*H63/0.9+0.001","v":1E-3},6000,{"$f":"V$2*Übersicht!X$28*J63/0.65+0.001","v":1E-3},6000,{"$f":"X$2*Übersicht!X$29*L63/1+0.001","v":1E-3}]
[7000,0.17508421690560499,7000,1.1499999999999999,7000,0.27100000000000002,7000,0.9,7000,0.65009436423561195,7000,1.0112086389142201,null,7000,{"$f":"N$2*Übersicht!X$24*B64/0.175+0.001","v":1E-3},7000,{"$f":"P$2*Übersicht!X$25*D64/1.15+0.001","v":1E-3},7000,{"$f":"R$2*Übersicht!X$26*F64/0.271+0.001","v":1E-3},7000,{"$f":"T$2*Übersicht!X$27*H64/0.9+0.001","v":1E-3},7000,{"$f":"V$2*Übersicht!X$28*J64/0.65+0.001","v":1E-3},7000,{"$f":"X$2*Übersicht!X$29*L64/1+0.001","v":1E-3}]
[8000,0.17507370253308799,8000,1.1499999999999999,8000,0.27100000000000002,8000,0.9,8000,0.65008258125013996,8000,1.0098157581221601,null,8000,{"$f":"N$2*Übersicht!X$24*B65/0.175+0.001","v":1E-3},8000,{"$f":"P$2*Übersicht!X$25*D65/1.15+0.001","v":1E-3},8000,{"$f":"R$2*Übersicht!X$26*F65/0.271+0.001","v":1E-3},8000,{"$f":"T$2*Übersicht!X$27*H65/0.9+0.001","v":1E-3},8000,{"$f":"V$2*Übersicht!X$28*J65/0.65+0.001","v":1E-3},8000,{"$f":"X$2*Übersicht!X$29*L65/1+0.001","v":1E-3}]
[9000,0.175065514895029,9000,1.1499999999999999,9000,0.27100000000000002,9000,0.9,9000,0.65007340607373498,9000,1.00872983514554,null,9000,{"$f":"N$2*Übersicht!X$24*B66/0.175+0.001","v":1E-3},9000,{"$f":"P$2*Übersicht!X$25*D66/1.15+0.001","v":1E-3},9000,{"$f":"R$2*Übersicht!X$26*F66/0.271+0.001","v":1E-3},9000,{"$f":"T$2*Übersicht!X$27*H66/0.9+0.001","v":1E-3},9000,{"$f":"V$2*Übersicht!X$28*J66/0.65+0.001","v":1E-3},9000,{"$f":"X$2*Übersicht!X$29*L66/1+0.001","v":1E-3}]
[10000,0.17505896450886299,10000,1.1499999999999999,10000,0.27100000000000002,10000,0.9,10000,0.65006606583937099,10000,1.00786025434158,null,10000,{"$f":"N$2*Übersicht!X$24*B67/0.175+0.001","v":1E-3},10000,{"$f":"P$2*Übersicht!X$25*D67/1.15+0.001","v":1E-3},10000,{"$f":"R$2*Übersicht!X$26*F67/0.271+0.001","v":1E-3},10000,{"$f":"T$2*Übersicht!X$27*H67/0.9+0.001","v":1E-3},10000,{"$f":"V$2*Übersicht!X$28*J67/0.65+0.001","v":1E-3},10000,{"$f":"X$2*Übersicht!X$29*L67/1+0.001","v":1E-3}]

{"sheet":"USV","index":5,"n_rows":8,"n_cols":5,"rows_kept":8,"cut":false,"hidden":true,"merged":[]}
[true]
[]
[{"$f":"D3*Übersicht!$X$22*$A$1+0.001","v":1E-3},{"$f":"E3","v":10000},null,1.1000000000000001,10000]
[{"$f":"D4*Übersicht!$X$22*$A$1+0.001","v":1E-3},{"$f":"E4","v":300},null,1.1000000000000001,300]
[{"$f":"D5*Übersicht!$X$22*$A$1+0.001","v":1E-3},60,null,{"$f":"IF(D8>1.3,1.3,D3)","v":1.3},60]
[{"$f":"D6*Übersicht!$X$22*$A$1+0.001","v":1E-3},10,null,{"$f":"Übersicht!$M$4","v":1.5},10]
[{"$f":"D7*Übersicht!$X$22*$A$1+0.001","v":1E-3},2,null,{"$f":"Übersicht!$M$4","v":1.5},2]
[{"$f":"D8*Übersicht!$X$22*$A$1+0.001","v":1E-3},1E-3,null,{"$f":"Übersicht!$M$4","v":1.5},1E-3]