{"text_format":"1","workbook":"xlsx","n_sheets":6,"sheets":["Übersicht","Änderungen","Berechnung","LSS","Lasten","USV"],"not_rendered":{"charts":1,"images":1,"macros":1,"external_links":0,"defined_names":2,"comments":1,"pivot_tables":0},"unopened":[],"bounds":{"document_bytes":16777216,"sheet_cells":100000,"rows_first":2000,"rows_last":500,"rows_between":2000,"halvings":0,"cell_chars":16384,"cell_head_chars":4096},"cells_cut":0,"cells_raw":0,"read":"whole","date_system":"1900"}

{"sheet":"Übersicht","index":0,"n_rows":34,"n_cols":27,"rows_kept":34,"cut":false,"hidden":false,"merged":[[15,18,15,19],[15,25,15,26],[16,19,16,20],[16,24,16,25],[30,18,30,26],[28,18,28,22],[19,18,19,26],[20,18,20,26],[22,18,22,26],[23,18,23,22],[17,19,17,25],[21,18,21,22],[23,23,23,24],[21,23,21,24],[13,1,13,6],[2,19,2,25],[8,19,8,25],[7,24,7,25],[7,19,7,20],[3,19,3,20],[3,24,3,25],[6,18,6,19],[4,18,4,19],[4,25,4,26],[6,25,6,26],[11,19,11,25],[12,19,12,20],[12,24,12,25],[13,18,13,19],[13,25,13,26],[14,1,14,2],[14,3,14,8],[25,3,26,8],[25,1,26,2],[20,1,20,8],[17,1,18,8],[33,1,38,8],[28,1,28,8],[32,18,32,26],[24,23,24,24],[25,23,25,24],[26,23,26,24],[27,23,27,24],[28,23,28,24],[31,18,31,26],[27,18,27,22],[29,18,29,22],[29,23,29,24],[26,18,26,22],[25,18,25,22],[24,18,24,22],[21,3,24,8]]}
[]
[null,"Information 1:",null,null,null,null,null,null,null,"Nennstrom:","Faktor:"]
[null,"Welchen Nennstrom IN,UPS liefert die USV-Anlage?",null,null,null,null,null,null,"A",null,null,null,null,null,null,null,null,null,null,{"$f":"CHOOSE(AA3,\"\",Berechnung!A11,Berechnung!C11,Berechnung!E11,Berechnung!G11,Berechnung!I11,Berechnung!K11,Berechnung!M11)","v":""},null,null,null,null,null,null,1]
[null,"oder",null,null,null,null,null,{"$f":"IF(AND(ISNUMBER(H3),ISNUMBER(H5)),\"Bitte nur ein Feld befüllen\",\"\")","v":""},null,{"$f":"IF(ISNUMBER(H3),H3,(1000*H5/(230*(2*H6-1))))","v":0},{"$f":"L20/J4","v":{"$error":"#DIV/0!"}},null,{"$f":"CHOOSE(H17,J21,J22,J23,J24,J25,J26,J27,J28,J29,J30,J31)","v":1.5},null,null,null,null,null,null,{"$f":"CHOOSE(AA3,\"\",Berechnung!A20,Berechnung!C20,Berechnung!E20,Berechnung!G20,Berechnung!I20,Berechnung!K20,Berechnung!M20)","v":""},null,null,null,null,{"$f":"CHOOSE(AA3,\"\",Berechnung!A12,Berechnung!C12,Berechnung!E12,Berechnung!G12,Berechnung!I12,Berechnung!K12,Berechnung!M12)","v":""}]
[null,"Welche Leistung hat die USV-Anlage",null,null,null,null,null,null,"kVA",null,{"$f":"H11/K20","v":{"$error":"#DIV/0!"}},null,null,null,null,null,null,null,{"$f":"CHOOSE(AA3,\"\",Berechnung!A19,Berechnung!C19,Berechnung!E19,Berechnung!G19,Berechnung!I19,Berechnung!K19,Berechnung!M19)","v":""},null,null,null,null,null,null,{"$f":"CHOOSE(AA3,\"\",Berechnung!A13,Berechnung!C13,Berechnung!E13,Berechnung!G13,Berechnung!I13,Berechnung!K13,Berechnung!M13)","v":""}]
[null,"bei Anzahl Phasen",null,null,null,null,null,1,{"$f":"IF(ISNUMBER(H5),CONCATENATE(\" I_N,UPS = \",ROUND(J4,1),\" A\"),\"\")","v":""}]
[null,null,null,null,null,null,null,null,null,"1phasig",null,null,null,null,null,null,null,null,{"$f":"CHOOSE(AA3,\"\",Berechnung!A18,Berechnung!C18,Berechnung!E18,Berechnung!G18,Berechnung!I18,Berechnung!K18,Berechnung!M18)","v":""},null,null,null,null,null,null,{"$f":"CHOOSE(AA3,\"\",Berechnung!A14,Berechnung!C14,Berechnung!E14,Berechnung!G14,Berechnung!I14,Berechnung!K14,Berechnung!M14)","v":""}]
[null,"Information 2:",null,null,null,null,null,null,null,"3phasig",null,null,null,null,null,null,null,null,null,{"$f":"CHOOSE(AA3,\"\",Berechnung!A17,Berechnung!C17,Berechnung!E17,Berechnung!G17,Berechnung!I17,Berechnung!K17,Berechnung!M17)","v":""},null,null,null,null,{"$f":"CHOOSE(AA3,\"\",Berechnung!A15,Berechnung!C15,Berechnung!E15,Berechnung!G15,Berechnung!I15,Berechnung!K15,Berechnung!M15)","v":""}]
[null,"Welcher Leitungsschutz-Typ wird bisher verwendet?",null,null,null,null,null,10,null,null,"Mindestauslösestrom","Höchstauslösestrom","Kommentar Fehlauslösung","Kommentar Kurzschluss","EBU I_Nenn,min",null,null,null,null,{"$f":"CHOOSE(AA3,\"\",Berechnung!A16,Berechnung!C16,Berechnung!E16,Berechnung!G16,Berechnung!I16,Berechnung!K16,Berechnung!M16)","v":""}]
[null,"oder",null,null,null,null,null,null,null,"\"kleiner\"",17.899999999999999,29.9,{"$f":"IF($H$11<$K10,CONCATENATE(\"Fehlauslösungen unwahrscheinlich.\"),CONCATENATE(\"Fehlauslösungen wahrscheinlich\"))","v":"Fehlauslösungen unwahrscheinlich."},{"$f":"IF(($J$4*M4)>$L10,CONCATENATE(\"Auslösung mit dem <\",ROUND($L10/$J$4,1),\"-fachen USV-Nennstrom wahrscheinlich.*\"),CONCATENATE(\"Auslösung mit dem <\",ROUND($L10/$J$4,1),\"-fachen USV-Nennstrom unwahrscheinlich.*\"))","v":{"$error":"#DIV/0!"}},null,null,null,null,null,null,null,null,null,null,null,null,"IN,UPS"]
[null,"Wie hoch ist der Einschaltstrom der angeschlossenen Last?",null,null,null,null,null,null,"A","B6",18,30,{"$f":"IF($H$11<$K11,CONCATENATE(\"Der Einschaltstrom erreicht den Mindestauslösestrom zu \",ROUND(100*$H$11/$K11,0),\"%. Es treten keine Fehlauslösungen auf.\"),CONCATENATE(\"Der Einschaltstrom überschreitet den Mindestauslösestrom zu \",ROUND(100*$H$11/$K11,0),\"%. Es treten möglicherweise Fehlauslösungen auf.\"))","v":"Der Einschaltstrom erreicht den Mindestauslösestrom zu 0%. Es treten keine Fehlauslösungen auf."},{"$f":"IF(($J$4*$M$4)>=$L11,CONCATENATE(\"Der bisher verwendete Leitungsschutzschalter kann von der USV-Anlage mit dem \",ROUND($L11/$J$4,1),\"-fachen USV-Nennstrom sicher ausgelöst werden.\"),CONCATENATE(\"Für die sichere Auslösung wäre der \",ROUND($L11/$J$4,1),\"-fache USV-Nennstrom notwendig. Dieser Wert wird durch die USV-Anlage nicht erreicht!\"))","v":{"$error":"#DIV/0!"}},7,{"$f":"IF(AND($H$14<INDEX(Berechnung!$A$20:$N$20,1,2*(ROW($O11)-ROW($O$10))),$O11<$J$4,ISBLANK($H$11),INDEX($K$10:$K$19,$H$9,1)<=$K11),TRUE,IF(AND($O11<$J$4,$H$11<(1.067*$K11),ISNUMBER($H$11)),TRUE,FALSE))","v":false},{"$f":"MATCH(TRUE,OFFSET($P$11:$P$17,0,,),0)","v":{"$error":"#N/A"}}]
[null,null,null,null,null,null,null,null,null,"B10",30,50,"Der Einschaltstrom erreicht den Mindestauslösestrom zu 0%. Es treten keine Fehlauslösungen auf.",{"$error":"#DIV/0!"},11,{"$f":"IF(AND($H$14<INDEX(Berechnung!$A$20:$N$20,1,2*(ROW($O12)-ROW($O$10))),$O12<$J$4,ISBLANK($H$11),INDEX($K$10:$K$19,$H$9,1)<=$K12),TRUE,IF(AND($O12<$J$4,$H$11<(1.067*$K12),ISNUMBER($H$11)),TRUE,FALSE))","v":false},{"$f":"MATCH(TRUE,OFFSET($P$11:$P$17,Q11,),0)+Q11","v":{"$error":"#N/A"}},null,null,{"$f":"CHOOSE(AA3,\"\",Berechnung!B11,Berechnung!D11,Berechnung!F11,Berechnung!H11,Berechnung!J11,Berechnung!L11,Berechnung!N11)","v":""}]
[null,"Optional Information 3:",null,null,null,null,null,null,null,"B16",48,80,"Der Einschaltstrom erreicht den Mindestauslösestrom zu 0%. Es treten keine Fehlauslösungen auf.",{"$error":"#DIV/0!"},17,{"$f":"IF(AND($H$14<INDEX(Berechnung!$A$20:$N$20,1,2*(ROW($O13)-ROW($O$10))),$O13<$J$4,ISBLANK($H$11),INDEX($K$10:$K$19,$H$9,1)<=$K13),TRUE,IF(AND($O13<$J$4,$H$11<(1.067*$K13),ISNUMBER($H$11)),TRUE,FALSE))","v":false},{"$error":"#N/A"},null,null,{"$f":"CHOOSE(AA3,\"\",Berechnung!B20,Berechnung!D20,Berechnung!F20,Berechnung!H20,Berechnung!J20,Berechnung!L20,Berechnung!N20)","v":""},null,null,null,null,{"$f":"CHOOSE(AA3,\"\",Berechnung!B12,Berechnung!D12,Berechnung!F12,Berechnung!H12,Berechnung!J12,Berechnung!L12,Berechnung!N12)","v":""}]
[null,"Was ist der Nennstrom IN,Load der angeschlossenen Last?",null,null,null,null,null,null,"A","C4",20,40,"Der Einschaltstrom erreicht den Mindestauslösestrom zu 0%. Es treten keine Fehlauslösungen auf.",{"$error":"#DIV/0!"},4.3,{"$f":"IF(AND($H$14<INDEX(Berechnung!$A$20:$N$20,1,2*(ROW($O14)-ROW($O$10))),$O14<$J$4,ISBLANK($H$11),INDEX($K$10:$K$19,$H$9,1)<=$K14),TRUE,IF(AND($O14<$J$4,$H$11<(1.067*$K14),ISNUMBER($H$11)),TRUE,FALSE))","v":false},{"$error":"#N/A"},null,{"$f":"CHOOSE(AA3,\"\",Berechnung!B19,Berechnung!D19,Berechnung!F19,Berechnung!H19,Berechnung!J19,Berechnung!L19,Berechnung!N19)","v":""},null,null,null,null,null,null,{"$f":"CHOOSE(AA3,\"\",Berechnung!B13,Berechnung!D13,Berechnung!F13,Berechnung!H13,Berechnung!J13,Berechnung!L13,Berechnung!N13)","v":""}]
[null,null,null,null,null,null,null,null,null,"C6",30,60,"Der Einschaltstrom erreicht den Mindestauslösestrom zu 0%. Es treten keine Fehlauslösungen auf.",{"$error":"#DIV/0!"},7,{"$f":"IF(AND($H$14<INDEX(Berechnung!$A$20:$N$20,1,2*(ROW($O15)-ROW($O$10))),$O15<$J$4,ISBLANK($H$11),INDEX($K$10:$K$19,$H$9,1)<=$K15),TRUE,IF(AND($O15<$J$4,$H$11<(1.067*$K15),ISNUMBER($H$11)),TRUE,FALSE))","v":false},{"$error":"#N/A"}]
{"$rows_left_out":20}
{"sheet":"Änderungen","index":1,"n_rows":1,"n_cols":2,"rows_kept":1,"cut":false,"hidden":true,"merged":[]}
["V 1.0.0","- Hinweise wegen logarithmischer Darstellung eliminiert --> Keine 0-Werte mehr\n- Eingabe des Kurzschlussstroms ermöglicht\n- Bei jedem Öffnen der Datei wird ein leeres Grafikfenster angezeigt. Wenn eine Eingabe des LSS erfolgt, wird die dazu passende Kennlinie angezeigt. Wenn ein EBU gewählt wird, wird diese LSS-Kennlinie mit dem EBU überschrieben"]

{"sheet":"Berechnung","index":2,"n_rows":74,"n_cols":14,"rows_kept":74,"cut":false,"hidden":true,"merged":[]}
[null,null,409.6,409.6,"(2/5)*1024",null,null,null,"wählen"]
[null,null,1,1,null,{"$f":"IF(Übersicht!AA3=1,Übersicht!H9-1,Übersicht!AA3-1)","v":9},0,0,"B6",{"$f":"CHOOSE(F2,I2,I3,I4,I5,I6,I7,I8)","v":{"$error":"#VALUE!"}}]
[null,null,0.05,0.05,null,null,null,null,"B10"]
[null,null,0.6,0.3,null,null,null,null,"B16"]
[null,null,1.7,1.3,null,null,null,null,"C4"]
[null,null,2.2000000000000002,4.2,null,null,null,null,"C6"]
[null,null,null,null,null,null,null,null,"C10"]
[null,null,null,null,null,null,null,null,"C16"]
[6.8000000000000005E-2,null,0.112,null,0.17899999999999999,null,8.2000000000000003E-2,null,0.128,null,0.22,null,0.34699999999999998]
[5.3999999999999999E-2,null,5.3999999999999999E-2,null,5.3999999999999999E-2,null,5.3999999999999999E-2,null,5.3999999999999999E-2,null,5.3999999999999999E-2,null,5.3999999999999999E-2]
[7,"OFF",11,"OFF",17,"OFF",4.3,"OFF",7,"OFF",11,"OFF",17,"OFF"]
[7.5,2,12,3,19,4,5.5,1.3,8,2,12,3,21,4]
[8,2.5,13,3.5,21,5,6.5,1.6,9,2.5,14,3.5,25,5]
[8.5,3,14,4,23,6,7,2,11,3,16,4,28,6]
[9,3.5,15,5,25,7,8.5,2.2999999999999998,12,3.5,21,5,34,7]
{"$rows_left_out":60}
{"sheet":"LSS","index":3,"n_rows":93,"n_cols":11,"rows_kept":93,"cut":false,"hidden":true,"merged":[]}
[]
[null,{"$f":"(Berechnung!$A$33*Berechnung!$B$30+Berechnung!$C$33*Berechnung!$D$30+Berechnung!$E$33*Berechnung!$F$30+Berechnung!$G$33*Berechnung!$H$30+Berechnung!$I$33*Berechnung!$J$30+Berechnung!$K$33*Berechnung!$L$30+Berechnung!$M$33*Berechnung!$N$30)*E2*$H$2+0.001","v":1E-3},{"$f":"F2","v":9999},null,1.0517941336950001,9999,null,{"$f":"(Berechnung!A33+Berechnung!C33+Berechnung!E33)","v":0},null,true]
[null,{"$f":"(Berechnung!$A$33*Berechnung!$B$30+Berechnung!$C$33*Berechnung!$D$30+Berechnung!$E$33*Berechnung!$F$30+Berechnung!$G$33*Berechnung!$H$30+Berechnung!$I$33*Berechnung!$J$30+Berechnung!$K$33*Berechnung!$L$30+Berechnung!$M$33*Berechnung!$N$30)*E3*$H$2+0.001","v":1E-3},{"$f":"F3","v":4009.5139155249999},null,1.051741373971,4009.5139155249999,null,null,null,{"$f":"IF(ISNUMBER(Übersicht!$H$14),Übersicht!$H$14,0.001)","v":1E-3},{"$f":"10000*J2","v":10000}]
[null,{"$f":"(Berechnung!$A$33*Berechnung!$B$30+Berechnung!$C$33*Berechnung!$D$30+Berechnung!$E$33*Berechnung!$F$30+Berechnung!$G$33*Berechnung!$H$30+Berechnung!$I$33*Berechnung!$J$30+Berechnung!$K$33*Berechnung!$L$30+Berechnung!$M$33*Berechnung!$N$30)*E4*$H$2+0.001","v":1E-3},996.52761345529996,null,1.092564842224,996.52761345529996,null,null,null,{"$f":"IF(ISNUMBER(Übersicht!$H$14),Übersicht!$H$14,0.001)","v":1E-3},{"$f":"1*J2","v":1}]
[null,{"$f":"(Berechnung!$A$33*Berechnung!$B$30+Berechnung!$C$33*Berechnung!$D$30+Berechnung!$E$33*Berechnung!$F$30+Berechnung!$G$33*Berechnung!$H$30+Berechnung!$I$33*Berechnung!$J$30+Berechnung!$K$33*Berechnung!$L$30+Berechnung!$M$33*Berechnung!$N$30)*E5*$H$2+0.001","v":1E-3},300.63812802059999,null,1.145863560525,300.63812802059999,null,null,null,{"$f":"IF(ISNUMBER(Übersicht!$H$11),Übersicht!$H$11,Übersicht!$H$14+0.001)","v":1E-3},{"$f":"0.01*J2","v":0.01}]
[null,{"$f":"(Berechnung!$A$33*Berechnung!$B$30+Berechnung!$C$33*Berechnung!$D$30+Berechnung!$E$33*Berechnung!$F$30+Berechnung!$G$33*Berechnung!$H$30+Berechnung!$I$33*Berechnung!$J$30+Berechnung!$K$33*Berechnung!$L$30+Berechnung!$M$33*Berechnung!$N$30)*E6*$H$2+0.001","v":1E-3},146.479514303,null,1.204663299331,146.479514303,null,null,null,{"$f":"IF(ISNUMBER(Übersicht!$H$11),Übersicht!$H$11,Übersicht!$H$14+0.001)","v":1E-3},{"$f":"0.001*J2","v":1E-3}]
[null,{"$f":"(Berechnung!$A$33*Berechnung!$B$30+Berechnung!$C$33*Berechnung!$D$30+Berechnung!$E$33*Berechnung!$F$30+Berechnung!$G$33*Berechnung!$H$30+Berechnung!$I$33*Berechnung!$J$30+Berechnung!$K$33*Berechnung!$L$30+Berechnung!$M$33*Berechnung!$N$30)*E7*$H$2+0.001","v":1E-3},69.92799576569,null,1.3001418489500001,69.92799576569]
[null,{"$f":"(Berechnung!$A$33*Berechnung!$B$30+Berechnung!$C$33*Berechnung!$D$30+Berechnung!$E$33*Berechnung!$F$30+Berechnung!$G$33*Berechnung!$H$30+Berechnung!$I$33*Berechnung!$J$30+Berechnung!$K$33*Berechnung!$L$30+Berechnung!$M$33*Berechnung!$N$30)*E8*$H$2+0.001","v":1E-3},42.641157692599997,null,1.3898847158580001,42.641157692599997]
[null,{"$f":"(Berechnung!$A$33*Berechnung!$B$30+Berechnung!$C$33*Berechnung!$D$30+Berechnung!$E$33*Berechnung!$F$30+Berechnung!$G$33*Berechnung!$H$30+Berechnung!$I$33*Berechnung!$J$30+Berechnung!$K$33*Berechnung!$L$30+Berechnung!$M$33*Berechnung!$N$30)*E9*$H$2+0.001","v":1E-3},26.537837862149999,null,1.507236989536,26.537837862149999]
[null,{"$f":"(Berechnung!$A$33*Berechnung!$B$30+Berechnung!$C$33*Berechnung!$D$30+Berechnung!$E$33*Berechnung!$F$30+Berechnung!$G$33*Berechnung!$H$30+Berechnung!$I$33*Berechnung!$J$30+Berechnung!$K$33*Berechnung!$L$30+Berechnung!$M$33*Berechnung!$N$30)*E10*$H$2+0.001","v":1E-3},10.01994484664,null,1.867979089513,10.01994484664]
[null,{"$f":"(Berechnung!$A$33*Berechnung!$B$30+Berechnung!$C$33*Berechnung!$D$30+Berechnung!$E$33*Berechnung!$F$30+Berechnung!$G$33*Berechnung!$H$30+Berechnung!$I$33*Berechnung!$J$30+Berechnung!$K$33*Berechnung!$L$30+Berechnung!$M$33*Berechnung!$N$30)*E11*$H$2+0.001","v":1E-3},4.7348933269740003,null,2.3040738203109998,4.7348933269740003]
[null,{"$f":"(Berechnung!$A$33*Berechnung!$B$30+Berechnung!$C$33*Berechnung!$D$30+Berechnung!$E$33*Berechnung!$F$30+Berechnung!$G$33*Berechnung!$H$30+Berechnung!$I$33*Berechnung!$J$30+Berechnung!$K$33*Berechnung!$L$30+Berechnung!$M$33*Berechnung!$N$30)*E12*$H$2+0.001","v":1E-3},2.3908132674110001,null,2.8760794179069999,2.3908132674110001]
[null,{"$f":"(Berechnung!$A$33*Berechnung!$B$30+Berechnung!$C$33*Berechnung!$D$30+Berechnung!$E$33*Berechnung!$F$30+Berechnung!$G$33*Berechnung!$H$30+Berechnung!$I$33*Berechnung!$J$30+Berechnung!$K$33*Berechnung!$L$30+Berechnung!$M$33*Berechnung!$N$30)*E13*$H$2+0.001","v":1E-3},2.01023667174,null,3.045465715063,2.01023667174]
[null,{"$f":"(Berechnung!$A$33*Berechnung!$B$30+Berechnung!$C$33*Berechnung!$D$30+Berechnung!$E$33*Berechnung!$F$30+Berechnung!$G$33*Berechnung!$H$30+Berechnung!$I$33*Berechnung!$J$30+Berechnung!$K$33*Berechnung!$L$30+Berechnung!$M$33*Berechnung!$N$30)*E14*$H$2+0.001","v":1E-3},1.7250725656649999,null,3.1189409224090001,1.7250725656649999]
[null,{"$f":"(Berechnung!$A$33*Berechnung!$B$30+Berechnung!$C$33*Berechnung!$D$30+Berechnung!$E$33*Berechnung!$F$30+Berechnung!$G$33*Berechnung!$H$30+Berechnung!$I$33*Berechnung!$J$30+Berechnung!$K$33*Berechnung!$L$30+Berechnung!$M$33*Berechnung!$N$30)*E15*$H$2+0.001","v":1E-3},1.510866837137,null,3.1563309525180001,1.510866837137]
{"$rows_left_out":79}
{"sheet":"Lasten","index":4,"n_rows":67,"n_cols":25,"rows_kept":67,"cut":false,"hidden":true,"merged":[[0,23,0,24],[1,23,1,24],[0,10,0,11],[1,10,1,11],[0,21,0,22],[1,21,1,22],[0,13,0,14],[0,15,0,16],[0,17,0,18],[0,19,0,20],[1,13,1,14],[1,15,1,16],[1,17,1,18],[1,19,1,20],[0,8,0,9],[0,0,0,1],[0,2,0,3],[0,4,0,5],[0,6,0,7]]}
[]
[null,null,null,null,null,null,null,null,null,null,null,null,null,false,null,false,null,false,null,false,null,false,null,false]
[]
[1E-3,0.21422644951178399,1E-3,9.2175187715685105,1E-3,1.1850454814853399,1E-3,18.464706725758202,1E-3,0.98035122038058897,1E-3,73.734027453058701,null,{"$f":"A4","v":1E-3},{"$f":"N$2*Übersicht!X$24*B4/0.175+0.001","v":1E-3},{"$f":"C4","v":1E-3},{"$f":"P$2*Übersicht!X$25*D4/1.15+0.001","v":1E-3},{"$f":"E4","v":1E-3},{"$f":"R$2*Übersicht!X$26*F4/0.271+0.001","v":1E-3},{"$f":"G4","v":1E-3},{"$f":"T$2*Übersicht!X$27*H4/0.9+0.001","v":1E-3},{"$f":"I4","v":1E-3},{"$f":"V$2*Übersicht!X$28*J4/0.65+0.001","v":1E-3},{"$f":"K4","v":1E-3},{"$f":"X$2*Übersicht!X$29*L4/1+0.001","v":1E-3}]
[2E-3,0.28409396210923699,2E-3,17.8069234684883,2E-3,2.1271775227413001,2E-3,13.8085872315741,2E-3,1.7211445576580899,2E-3,77.844716800211103,null,{"$f":"A5","v":2E-3},{"$f":"N$2*Übersicht!X$24*B5/0.175+0.001","v":1E-3},{"$f":"C5","v":2E-3},{"$f":"P$2*Übersicht!X$25*D5/1.15+0.001","v":1E-3},{"$f":"E5","v":2E-3},{"$f":"R$2*Übersicht!X$26*F5/0.271+0.001","v":1E-3},{"$f":"G5","v":2E-3},{"$f":"T$2*Übersicht!X$27*H5/0.9+0.001","v":1E-3},{"$f":"I5","v":2E-3},{"$f":"V$2*Übersicht!X$28*J5/0.65+0.001","v":1E-3},{"$f":"K5","v":2E-3},{"$f":"X$2*Übersicht!X$29*L5/1+0.001","v":1E-3}]
[3.0000000000000001E-3,0.29010229831395701,3.0000000000000001E-3,19.7446462044561,3.0000000000000001E-3,2.9070394980868199,3.0000000000000001E-3,11.250401555001201,3.0000000000000001E-3,2.3045397105346099,3.0000000000000001E-3,77.308581796592904,null,3.0000000000000001E-3,{"$f":"N$2*Übersicht!X$24*B6/0.175+0.001","v":1E-3},3.0000000000000001E-3,{"$f":"P$2*Übersicht!X$25*D6/1.15+0.001","v":1E-3},3.0000000000000001E-3,{"$f":"R$2*Übersicht!X$26*F6/0.271+0.001","v":1E-3},3.0000000000000001E-3,{"$f":"T$2*Übersicht!X$27*H6/0.9+0.001","v":1E-3},3.0000000000000001E-3,{"$f":"V$2*Übersicht!X$28*J6/0.65+0.001","v":1E-3},3.0000000000000001E-3,{"$f":"X$2*Übersicht!X$29*L6/1+0.001","v":1E-3}]
[4.0000000000000001E-3,0.27140776716966802,4.0000000000000001E-3,19.3284253590062,4.0000000000000001E-3,3.1577530655962698,4.0000000000000001E-3,9.7643211758687407,4.0000000000000001E-3,2.6330228011987402,4.0000000000000001E-3,73.146775954789703,null,4.0000000000000001E-3,{"$f":"N$2*Übersicht!X$24*B7/0.175+0.001","v":1E-3},4.0000000000000001E-3,{"$f":"P$2*Übersicht!X$25*D7/1.15+0.001","v":1E-3},4.0000000000000001E-3,{"$f":"R$2*Übersicht!X$26*F7/0.271+0.001","v":1E-3},4.0000000000000001E-3,{"$f":"T$2*Übersicht!X$27*H7/0.9+0.001","v":1E-3},4.0000000000000001E-3,{"$f":"V$2*Übersicht!X$28*J7/0.65+0.001","v":1E-3},4.0000000000000001E-3,{"$f":"X$2*Übersicht!X$29*L7/1+0.001","v":1E-3}]
[5.0000000000000001E-3,0.242538450391659,5.0000000000000001E-3,17.902972547581999,5.0000000000000001E-3,3.07158473329322,5.0000000000000001E-3,8.7223381033454892,5.0000000000000001E-3,2.7409161101564301,5.0000000000000001E-3,65.894127978639702,null,5.0000000000000001E-3,{"$f":"N$2*Übersicht!X$24*B8/0.175+0.001","v":1E-3},5.0000000000000001E-3,{"$f":"P$2*Übersicht!X$25*D8/1.15+0.001","v":1E-3},5.0000000000000001E-3,{"$f":"R$2*Übersicht!X$26*F8/0.271+0.001","v":1E-3},5.0000000000000001E-3,{"$f":"T$2*Übersicht!X$27*H8/0.9+0.001","v":1E-3},5.0000000000000001E-3,{"$f":"V$2*Übersicht!X$28*J8/0.65+0.001","v":1E-3},5.0000000000000001E-3,{"$f":"X$2*Übersicht!X$29*L8/1+0.001","v":1E-3}]
[6.0000000000000001E-3,0.22550168368336701,6.0000000000000001E-3,16.4608902080451,6.0000000000000001E-3,2.8694899377540901,6.0000000000000001E-3,7.9727273807275001,6.0000000000000001E-3,2.6914852315301401,6.0000000000000001E-3,60.2578355813787,null,6.0000000000000001E-3,{"$f":"N$2*Übersicht!X$24*B9/0.175+0.001","v":1E-3},6.0000000000000001E-3,{"$f":"P$2*Übersicht!X$25*D9/1.15+0.001","v":1E-3},6.0000000000000001E-3,{"$f":"R$2*Übersicht!X$26*F9/0.271+0.001","v":1E-3},6.0000000000000001E-3,{"$f":"T$2*Übersicht!X$27*H9/0.9+0.001","v":1E-3},6.0000000000000001E-3,{"$f":"V$2*Übersicht!X$28*J9/0.65+0.001","v":1E-3},6.0000000000000001E-3,{"$f":"X$2*Übersicht!X$29*L9/1+0.001","v":1E-3}]
[7.0000000000000001E-3,0.21809508999174401,7.0000000000000001E-3,15.2607888965371,7.0000000000000001E-3,2.6673854784564002,7.0000000000000001E-3,7.3957454321195204,7.0000000000000001E-3,2.5525118900840802,7.0000000000000001E-3,55.8533662535853,null,7.0000000000000001E-3,{"$f":"N$2*Übersicht!X$24*B10/0.175+0.001","v":1E-3},7.0000000000000001E-3,{"$f":"P$2*Übersicht!X$25*D10/1.15+0.001","v":1E-3},7.0000000000000001E-3,{"$f":"R$2*Übersicht!X$26*F10/0.271+0.001","v":1E-3},7.0000000000000001E-3,{"$f":"T$2*Übersicht!X$27*H10/0.9+0.001","v":1E-3},7.0000000000000001E-3,{"$f":"V$2*Übersicht!X$28*J10/0.65+0.001","v":1E-3},7.0000000000000001E-3,{"$f":"X$2*Übersicht!X$29*L10/1+0.001","v":1E-3}]
[8.0000000000000002E-3,0.22278799584689299,8.0000000000000002E-3,14.262022365020799,8.0000000000000002E-3,2.4929631235874199,8.0000000000000002E-3,9.1355855685548093,8.0000000000000002E-3,2.3902766599766898,8.0000000000000002E-3,52.617940459798902,null,8.0000000000000002E-3,{"$f":"N$2*Übersicht!X$24*B11/0.175+0.001","v":1E-3},8.0000000000000002E-3,{"$f":"P$2*Übersicht!X$25*D11/1.15+0.001","v":1E-3},8.0000000000000002E-3,{"$f":"R$2*Übersicht!X$26*F11/0.271+0.001","v":1E-3},8.0000000000000002E-3,{"$f":"T$2*Übersicht!X$27*H11/0.9+0.001","v":1E-3},8.0000000000000002E-3,{"$f":"V$2*Übersicht!X$28*J11/0.65+0.001","v":1E-3},8.0000000000000002E-3,{"$f":"X$2*Übersicht!X$29*L11/1+0.001","v":1E-3}]
[8.9999999999999993E-3,0.230557117967821,8.9999999999999993E-3,13.456163251255701,8.9999999999999993E-3,2.3520951338296698,8.9999999999999993E-3,8.6798635514925806,8.9999999999999993E-3,2.27782566950094,8.9999999999999993E-3,49.608688708045101,null,8.9999999999999993E-3,{"$f":"N$2*Übersicht!X$24*B12/0.175+0.001","v":1E-3},8.9999999999999993E-3,{"$f":"P$2*Übersicht!X$25*D12/1.15+0.001","v":1E-3},8.9999999999999993E-3,{"$f":"R$2*Übersicht!X$26*F12/0.271+0.001","v":1E-3},8.9999999999999993E-3,{"$f":"T$2*Übersicht!X$27*H12/0.9+0.001","v":1E-3},8.9999999999999993E-3,{"$f":"V$2*Übersicht!X$28*J12/0.65+0.001","v":1E-3},8.9999999999999993E-3,{"$f":"X$2*Übersicht!X$29*L12/1+0.001","v":1E-3}]
[0.01,0.238755310241589,0.01,12.7587032962285,0.01,2.23268552181155,0.01,8.2392053492231199,0.01,2.2592865265794901,0.01,46.829735198654298,null,0.01,{"$f":"N$2*Übersicht!X$24*B13/0.175+0.001","v":1E-3},0.01,{"$f":"P$2*Übersicht!X$25*D13/1.15+0.001","v":1E-3},0.01,{"$f":"R$2*Übersicht!X$26*F13/0.271+0.001","v":1E-3},0.01,{"$f":"T$2*Übersicht!X$27*H13/0.9+0.001","v":1E-3},0.01,{"$f":"V$2*Übersicht!X$28*J13/0.65+0.001","v":1E-3},0.01,{"$f":"X$2*Übersicht!X$29*L13/1+0.001","v":1E-3}]
[0.02,0.22804425469460701,0.02,9.7991366986607993,0.02,1.57895369490814,0.02,7.5411714842946296,0.02,2.4630315949933199,0.02,35.647669099925402,null,0.02,{"$f":"N$2*Übersicht!X$24*B14/0.175+0.001","v":1E-3},0.02,{"$f":"P$2*Übersicht!X$25*D14/1.15+0.001","v":1E-3},0.02,{"$f":"R$2*Übersicht!X$26*F14/0.271+0.001","v":1E-3},0.02,{"$f":"T$2*Übersicht!X$27*H14/0.9+0.001","v":1E-3},0.02,{"$f":"V$2*Übersicht!X$28*J14/0.65+0.001","v":1E-3},0.02,{"$f":"X$2*Übersicht!X$29*L14/1+0.001","v":1E-3}]
[0.03,0.22253033228670199,0.03,8.0902668879074398,0.03,1.3343304896630499,0.03,7.3608321098475296,0.03,2.5511028354589098,0.03,30.677141079218401,null,0.03,{"$f":"N$2*Übersicht!X$24*B15/0.175+0.001","v":1E-3},0.03,{"$f":"P$2*Übersicht!X$25*D15/1.15+0.001","v":1E-3},0.03,{"$f":"R$2*Übersicht!X$26*F15/0.271+0.001","v":1E-3},0.03,{"$f":"T$2*Übersicht!X$27*H15/0.9+0.001","v":1E-3},0.03,{"$f":"V$2*Übersicht!X$28*J15/0.65+0.001","v":1E-3},0.03,{"$f":"X$2*Übersicht!X$29*L15/1+0.001","v":1E-3}]
{"$rows_left_out":53}
{"sheet":"USV","index":5,"n_rows":8,"n_cols":5,"rows_kept":8,"cut":false,"hidden":true,"merged":[]}
[true]
[]
[{"$f":"D3*Übersicht!$X$22*$A$1+0.001","v":1E-3},{"$f":"E3","v":10000},null,1.1000000000000001,10000]
[{"$f":"D4*Übersicht!$X$22*$A$1+0.001","v":1E-3},{"$f":"E4","v":300},null,1.1000000000000001,300]
[{"$f":"D5*Übersicht!$X$22*$A$1+0.001","v":1E-3},60,null,{"$f":"IF(D8>1.3,1.3,D3)","v":1.3},60]
[{"$f":"D6*Übersicht!$X$22*$A$1+0.001","v":1E-3},10,null,{"$f":"Übersicht!$M$4","v":1.5},10]
[{"$f":"D7*Übersicht!$X$22*$A$1+0.001","v":1E-3},2,null,{"$f":"Übersicht!$M$4","v":1.5},2]
[{"$f":"D8*Übersicht!$X$22*$A$1+0.001","v":1E-3},1E-3,null,{"$f":"Übersicht!$M$4","v":1.5},1E-3]